{"text_format":"1","workbook":"xlsx","n_sheets":5,"sheets":["DB","SERTIFIKAT","DATA","KHB","Macro1"],"not_rendered":{"charts":0,"images":6,"macros":1,"external_links":3,"defined_names":17,"comments":0,"pivot_tables":0},"unopened":[],"bounds":{"document_bytes":16777216,"sheet_cells":100000,"rows_first":2000,"rows_last":500,"rows_between":2000,"halvings":0,"cell_chars":16384,"cell_head_chars":4096},"cells_cut":0,"cells_raw":0,"read":"whole","date_system":"1900"}

{"sheet":"DB","index":0,"n_rows":35,"n_cols":4,"rows_kept":35,"cut":false,"hidden":true,"merged":[]}
[]
[1,59,"D","belum menunjukkan pemahaman yang cukup pada sebagian besar materi Pendidikan Lingkungan Hidup"]
[60,69,"C","sudah menunjukkan pemahaman yang cukup pada semua materi Pendidikan Lingkungan Hidup"]
[70,74,"B-","secara konsisten menunjukkan pemahaman yang mendalam pada sebagian materi Pendidikan Lingkungan Hidup"]
[75,79,"B","secara konsisten menunjukkan pemahaman yang mendalam pada sebagian materi Pendidikan Lingkungan Hidup"]
[80,84,"B+","secara konsisten menunjukkan pemahaman yang mendalam pada sebagian materi Pendidikan Lingkungan Hidup"]
[85,89,"A-","secara konsisten menunjukkan pemahaman yang mendalam pada semua materi Pendidikan Lingkungan Hidup"]
[90,94,"A","secara konsisten menunjukkan pemahaman yang mendalam pada semua materi Pendidikan Lingkungan Hidup"]
[95,100,"A+","secara konsisten menunjukkan pemahaman yang mendalam pada semua materi Pendidikan Lingkungan Hidup"]
[]
[]
["X TKP 1","Rini Anggraeni, S.Pd, M.Pd"]
["X TKP 2","Nuri Hastuti Nuryani, S.Pd"]
["X TK 1","Deden Hamdani, Drs."]
["X TK 2","Zian Muzakkiyah K, S.Pd, M.Pd"]
["X TM 1","Hj. Diah Gustanti, S.T"]
["X TM 2","Tamrin, Drs, M.Pd"]
["X TM 3","Suhartini, S.Pd"]
["X TM 4","Maolana Nopiansyah, s.Pd.I"]
["X TM 5","Siti Nurjanah, S.Pd"]
["X TM 6","Prapti Suharyanti, S.Pd"]
["X TM 7","Tri Puji Astuti, S.Pd"]
["X TM 8","Rini Nurmalasari, S.Pd"]
["X TO 1","Kusmaya, S.Pd"]
["X TO 2","Rika Nurlaela, S.Pd"]
["X TO 3","Saeful Ikhrom, A.Md"]
["X TO 4","Sumarsono, S.T"]
["X TE 1","Ida Farida Artati"]
["X TE 2","Encep Pranseda, Drs., M.Pd."]
["X TE 3","Faridawaty Saragih, S.Si"]
["X TKI 1","Rita Rosita, S.Pd"]
["X TKI 2","Mila Karuniawati, S.Pd"]
["X TKI 3","Indria Listiani Ningrum, S.T"]
["X TKI 4","Ahmad Bustomi Sahrul, S.Pd"]
["X TKI 5","Asep Saeful Rohman, S.Ag"]

{"sheet":"SERTIFIKAT","index":1,"n_rows":34,"n_cols":49,"rows_kept":34,"cut":false,"hidden":true,"merged":[[10,29,11,29],[6,1,6,24],[5,1,5,24],[9,1,9,24],[19,35,19,36],[12,35,13,35],[12,36,13,36],[9,35,9,36],[15,35,15,36],[16,35,17,35],[16,36,17,36],[10,35,11,35],[10,36,11,36],[10,1,10,24],[12,1,12,24],[2,4,2,20],[13,1,13,24],[7,1,7,24]]}
[]
[]
[null,null,null,null,"SERTIFIKAT",null,null,null,null,null,null,null,null,null,null,null,null,null,null,null,null,null,null,null,null,null,null,null,null,null,null,null,null,null,null,null,null,null,null,77,{"$f":"602-526","v":76}]
[null,null,null,null,null,null,null,null,null,null,null,null,null,null,null,null,null,null,null,null,null,null,null,null,null,null,null,null,null,null,null,null,null,null,null,null,null,null,null,{"$f":"158-77","v":81},{"$f":"671-602","v":69}]
[null,null,null,null,null,null,null,null,null,null,null,null,null,null,null,null,null,null,null,null,null,null,null,null,null,null,null,null,null,null,null,null,null,null,null,null,null,null,null,{"$f":"230-158","v":72},{"$f":"821-671","v":150}]
[null,"Diberikan Kepada",null,null,null,null,null,null,null,null,null,null,null,null,null,null,null,null,null,null,null,null,null,null,null,null,null,null,null,null,null,null,null,null,null,null,null,null,null,{"$f":"379-230","v":149},{"$f":"898-821","v":77}]
[null,{"$f":"VLOOKUP($AK$17,DATASERTIFIKAT,DATA!E2)","v":"RAYHAN RAMADAN"},null,null,null,null,null,null,null,null,null,null,null,null,null,null,null,null,null,null,null,null,null,null,null,null,null,null,null,null,null,null,null,null,null,null,null,null,null,{"$f":"526-379","v":147}]
[null,{"$f":"\"NIS : \"&VLOOKUP($AK$17,DATASERTIFIKAT,DATA!F2)","v":"NIS : 18190204"}]
[]
[null,"Sebagai",null,null,null,null,null,null,null,null,null,null,null,null,null,null,null,null,null,null,null,null,null,null,null,null,null,null,null,"JURUSAN",null,null,null,null,null,"HALAMAN CETAK"]
[null,"Peringkat pertama",null,null,null,null,null,null,null,null,null,null,null,null,null,null,null,null,null,null,null,null,null,null,null,null,null,null,null,{"$error":"#REF!"},null,null,null,null,null,"Dari data ke",691]
[]
[null,"Pada Kelas XII TKJ 1 Semester Ganjil Tahun Pelajaran 2017/2018 Dengan Rata-rata Nilai 84,1",null,null,null,null,null,null,null,null,null,null,null,null,null,null,null,null,null,null,null,null,null,null,null,null,null,null,null,null,null,null,null,null,null,"Sampai data ke",695,null,null,{"$f":"72+149","v":221},{"$f":"77+81+150+77","v":385}]
[null,"Semoga Prestasi Yang Diraih Menjadi Motivasi Untuk Meraih Kesuksesan Di Masa Yang Akan Datang",null,null,null,null,null,null,null,null,null,null,null,null,null,null,null,null,null,null,null,null,null,null,null,null,null,null,null,null,null,null,null,null,null,null,null,null,null,{"$f":"147+76+69","v":292}]
[]
[null,null,null,null,null,null,null,null,null,null,null,null,null,null,null,null,null,null,null,null,null,null,null,null,null,null,null,null,null,null,null,null,null,null,null,"TAMPILAN DATA"]
[null,null,null,null,null,null,null,null,null,null,null,null,null,null,null,null,null,null,null,null,null,"Kepala SMKN 1 Karawang,",null,null,null,null,null,null,null,null,null,null,null,null,null,"Nomor Urut",240]
[]
[]
[null,null,null,null,null,null,null,null,null,null,null,null,null,null,null,null,null,null,null,null,null,null,null,null,null,null,null,null,null,null,null,null,null,null,null,{"$f":"VLOOKUP($AK$17,DATASERTIFIKAT,DATA!E2)","v":"RAYHAN RAMADAN"},null,null,null,null,null,"A",4,null,null,null,null,1,"D"]
[null,null,null,null,null,null,null,null,null,null,null,null,null,null,null,null,null,null,null,null,null,"Drs. Agus Rukmawan, S.IP, M.M"]
[null,null,null,null,null,null,null,null,null,null,null,null,null,null,null,null,null,null,null,null,null,"NIP. 19611111 198603 1 008"]
[]
[]
[]
[]
[]
[]
[]
[]
[]
[]
[]
[null,null,null,null,null,null,null,null,null,null,null,null,null,null,null,null,null,null,null,null,null,null,null,null,null,null,null,138]

{"sheet":"DATA","index":2,"n_rows":848,"n_cols":11,"rows_kept":848,"cut":false,"hidden":false,"merged":[]}
["NO.","CLASS ID","SORT","KELAS","NAMA SISWA","NIS","NISN","PENGETAHUAN 1","KETERAMPILAN 1","PENGETAHUAN 2","KETERAMPILAN 2"]
[1,{"$f":"A2+1","v":2},{"$f":"B2+1","v":3},4,5,6,7,8,9,10,11]
[1,{"$f":"D3&\"-\"&C3","v":"X TKP 1-1"},1,"X TKP 1","ABDUL KARIM",18190001,"0032989692",75,80,83,86]
[{"$f":"A3+1","v":2},"X TKP 1-2",{"$f":"IF(D3=D4,C3+1,1)","v":2},"X TKP 1","AIP ABDUL SUNANDAR",18190002,"0030065657",83,86,85,86]
[{"$f":"A4+1","v":3},{"$f":"D5&\"-\"&C5","v":"X TKP 1-3"},{"$f":"IF(D4=D5,C4+1,1)","v":3},"X TKP 1","ARYA FADEL HAKIM",18190003,"0021248937"]
[4,"X TKP 1-4",4,"X TKP 1","DESI",18190004,"0038817973"]
[5,"X TKP 1-5",5,"X TKP 1","DIAN LAURAINE ANAKKU",18190005,"0039899018"]
[6,"X TKP 1-6",6,"X TKP 1","DIMAS MAUSUL HAQIKI",18190006,"0032766311"]
[7,"X TKP 1-7",7,"X TKP 1","FISKA PUTRI DEWANI",18190007,"0031467706"]
[8,"X TKP 1-8",8,"X TKP 1","GELAR MAULANA MEDIA",18190008,"0029016811"]
[9,"X TKP 1-9",9,"X TKP 1","GILANG ILHAM PERMANA",18190009,"0034779820"]
[10,"X TKP 1-10",10,"X TKP 1","GILANG PRIA AMPATANA",18190010,"0022288946"]
[11,"X TKP 1-11",11,"X TKP 1","INDAH NURHALIZAH",18190011,"0030065656"]
[12,"X TKP 1-12",12,"X TKP 1","LUSIAWATI",18190013,"0037391018"]
[13,"X TKP 1-13",13,"X TKP 1","MOHAMAD SYAHRUL RIZKY",18190014,"-"]
[14,"X TKP 1-14",14,"X TKP 1","MUHAMMAD HAFIZH R",18190015,"0032783340"]
[15,"X TKP 1-15",15,"X TKP 1","MUHAMMAD RAFLY DWI RAHMAN",18190016,"0034779821"]
[16,"X TKP 1-16",16,"X TKP 1","MUHAMMAD RAIHAN",18190017,"0032491085"]
[17,"X TKP 1-17",17,"X TKP 1","MUHAMMAD RAIHANDY FAUZAN",18190018,"0039736055"]
[18,"X TKP 1-18",18,"X TKP 1","MUHAMMAD SALMAN",18190019,"0036773152"]
[19,"X TKP 1-19",19,"X TKP 1","MULYANTI",18190020,"0032741260"]
[20,"X TKP 1-20",20,"X TKP 1","NANA ARDIANSYAH",18190021,"0037748593"]
[21,"X TKP 1-21",21,"X TKP 1","NOVIA RAMADANI",18190022,"0039684937"]
[22,"X TKP 1-22",22,"X TKP 1","PUSPITA SARI",18190023,"0036607091"]
[23,"X TKP 1-23",23,"X TKP 1","QORI ABDUL MANSUR",18190024,"0037815117"]
[24,"X TKP 1-24",24,"X TKP 1","RAMLAN",18190025,"0031113948"]
[25,"X TKP 1-25",25,"X TKP 1","RARAS PRAMESTI",18190026,"0034805619"]
[26,"X TKP 1-26",26,"X TKP 1","RITA",18190027,"0034644760"]
[27,"X TKP 1-27",27,"X TKP 1","SALSABILA PUTRI SUHENDAR",18190028,"0037533933"]
[28,"X TKP 1-28",28,"X TKP 1","SITI ROSYDAH RUSTANDI",18190029,"0027950065"]
[29,"X TKP 1-29",29,"X TKP 1","SUKMA NOVIANTI",18190030,"0020500843"]
[30,"X TKP 1-30",30,"X TKP 1","SUSILAWATI",18190031,"0034132335"]
[31,"X TKP 1-31",31,"X TKP 1","TAUFIKURROHMAN ARDHAN",18190032,"0026074299"]
[32,"X TKP 1-32",32,"X TKP 1","WINDA",18190033,"0028658455"]
[33,"X TKP 1-33",33,"X TKP 1","YOSUA ANDREAS",18190034,"0023965427"]
[34,"X TKP 1-34",34,"X TKP 1","ZILDJIAN APRILIA",18190035,"0038657643"]
[35,"X TKP 2-1",1,"X TKP 2","ABDUL MAJID ALHISNA",18190036,"0034811338"]
[36,"X TKP 2-2",2,"X TKP 2","ANISA PUTRI HIDAYAT",18190037,"0032798639"]
[37,"X TKP 2-3",3,"X TKP 2","ANNISA PUTRI RAHAYU",18190038,"0030065584"]
[38,"X TKP 2-4",4,"X TKP 2","DILAN YUSUF ISLAMI",18190039,"0034779777"]
[39,"X TKP 2-5",5,"X TKP 2","DINA KHAIRUNNISA YARIS",18190040,"0032865899"]
[40,"X TKP 2-6",6,"X TKP 2","FARGAS FIRGIA",18190041,"0032615676"]
[41,"X TKP 2-7",7,"X TKP 2","FATHIYAH AIDA RIZMA",18190042,"0033471088"]
[42,"X TKP 2-8",8,"X TKP 2","FAUJI SETIAWAN",18190043,"0029435910"]
[43,"X TKP 2-9",9,"X TKP 2","FIRLI HILDAN FAHRURROZI",18190044,"0048780786"]
[44,"X TKP 2-10",10,"X TKP 2","IHDA PEBRIYANTI",18190046,"0031761174"]
[45,"X TKP 2-11",11,"X TKP 2","MAHESA SOFIAN SAPUTRA",18190047,"0035079626"]
[46,"X TKP 2-12",12,"X TKP 2","MARDANI",18190048,"0023849189"]
[47,"X TKP 2-13",13,"X TKP 2","MUCH FACHREADZKY RIDWAN",18190049,"3215015405"]
[48,"X TKP 2-14",14,"X TKP 2","MUHAMAD ZIHAN AWALIADIN",18190050,"0031002445"]
[49,"X TKP 2-15",15,"X TKP 2","MUHAMMAD FAUZAN MAKARIM",18190051,"0035316805"]
[50,"X TKP 2-16",16,"X TKP 2","MURSYID HANIF ARROJI",18190052,"0036243475"]
[51,"X TKP 2-17",17,"X TKP 2","NADILA AGUSTIN",18190053,"0039449407"]
[52,"X TKP 2-18",18,"X TKP 2","NAFIDZ ALIFAH MUKHRIJ PURNOMO",18190054,"0039553661"]
[53,"X TKP 2-19",19,"X TKP 2","RAYNALDO APRILIANO",18190055,"0032756888"]
[54,"X TKP 2-20",20,"X TKP 2","REVA ACHMAD ABQARI",18190056,"0031024779"]
[55,"X TKP 2-21",21,"X TKP 2","RICKY FAUZI",18190057,"0032516580"]
[56,"X TKP 2-22",22,"X TKP 2","RIFKY AHMAD RIANTO",18190058,"0034579920"]
[57,"X TKP 2-23",23,"X TKP 2","RIKI",18190059,"0027130013"]
[58,"X TKP 2-24",24,"X TKP 2","RIZKI MAULANA",18190060,"0039327074"]
[59,"X TKP 2-25",25,"X TKP 2","RIZKY MAULANA",18190061,"0027881567"]
[60,"X TKP 2-26",26,"X TKP 2","SAHRUL S RAHMADAN",18190062,"0035678900"]
[61,"X TKP 2-27",27,"X TKP 2","SANDI RUKMANA WAHYU ALAMSYAH",18190063,"0034283569"]
[62,"X TKP 2-28",28,"X TKP 2","SUCI NURAENI",18190065,"0011360536"]
[63,"X TKP 2-29",29,"X TKP 2","SUPARDI",18190066,"0035124599"]
[64,"X TKP 2-30",30,"X TKP 2","WAHYU AGUNG PRABOWO",18190067,"0029988519"]
[65,"X TKP 2-31",31,"X TKP 2","WIJDAN IBTISYAM",18190069,"0038671161"]
[66,"X TKP 2-32",32,"X TKP 2","YANUAR SILO HANDOYO",18190070,"0032611655"]
[{"$f":"A68+1","v":67},{"$f":"D69&\"-\"&C69","v":"X TKP 2-33"},{"$f":"IF(D68=D69,C68+1,1)","v":33},"X TKP 2","RENDRI NUZUL A'RIZKY","17180063","0002849791"]
[68,"X TK 1-1",1,"X TK 1","ABDUL HAFIDZ ZIAD FAESOL",18190071,"0039860796"]
[69,"X TK 1-2",2,"X TK 1","ADRIAN TEGAR FITRAYANSYAH",18190072,"0020786656"]
[70,"X TK 1-3",3,"X TK 1","ALWIANSYAH",18190073,"0032546772"]
[71,"X TK 1-4",4,"X TK 1","AZ ZAHRA DINDA KAMALIA",18190074,"0034418225"]
[72,"X TK 1-5",5,"X TK 1","BARA NAUFAL HILMAN",18190075,"0028174239"]
[73,"X TK 1-6",6,"X TK 1","BAYU MAULANA",18190076,"0037941012"]
[74,"X TK 1-7",7,"X TK 1","DARYADI",18190077,"0026277470"]
[75,"X TK 1-8",8,"X TK 1","DHAFA SEPTIAN PUFERTA HARYANTO",18190078,"0034478016"]
[76,"X TK 1-9",9,"X TK 1","DIENNA AGUSTIANA FITRIANA DEWI",18190079,"0036583246"]
[77,"X TK 1-10",10,"X TK 1","ELIS KHOERUNISA",18190080,"0033723028"]
[78,"X TK 1-11",11,"X TK 1","FADLAH FAQIH MASHOBIH",18190081,"0025939069"]
[79,"X TK 1-12",12,"X TK 1","FAJAR TRI NUGROHO",18190082,"0037233269"]
[80,"X TK 1-13",13,"X TK 1","GALIH SETIA NUGRAHA",18190083,"0034854147"]
[81,"X TK 1-14",14,"X TK 1","HAIKAL ZAENUL RAHMAT",18190084,"0020945997"]
[82,"X TK 1-15",15,"X TK 1","HAMAWIYAH MUZAHARA",18190085,"0038473396"]
[83,"X TK 1-16",16,"X TK 1","HARISMA HENDRIKA PERTIWI",18190086,"0033771811"]
[84,"X TK 1-17",17,"X TK 1","IQBAL SYAHID FIRMANSYAH",18190087,"0036799967"]
[85,"X TK 1-18",18,"X TK 1","KHOLIL RAMDAN",18190088,"0021482684"]
[86,"X TK 1-19",19,"X TK 1","LENI FITRIA",18190089,"0034945419"]
[87,"X TK 1-20",20,"X TK 1","MARIO ROLIANSYAH",18190090,"0039724970"]
[88,"X TK 1-21",21,"X TK 1","MUHAMMAD FARIZ",18190091,"0033872102"]
[89,"X TK 1-22",22,"X TK 1","MUHAMMAD MAULANA NUGRAHA",18190092,"0035895245"]
[90,"X TK 1-23",23,"X TK 1","MUHAMMAD ZIDAN",18190093,"0034441925"]
[91,"X TK 1-24",24,"X TK 1","NOVA",18190094,"0036985185"]
[92,"X TK 1-25",25,"X TK 1","NOVAL ARDIANTO",18190095,"0031971609"]
[93,"X TK 1-26",26,"X TK 1","NOVI",18190096,"0031580083"]
[94,"X TK 1-27",27,"X TK 1","NURFITRIA DESWITA PUTRI",18190097,"0026625233"]
[95,"X TK 1-28",28,"X TK 1","REVINA NOVIA ANINDARA",18190098,"0024435569"]
[96,"X TK 1-29",29,"X TK 1","REZA ARDIANSYAH",18190099,"0038234294"]
[97,"X TK 1-30",30,"X TK 1","REZA NUGRAHA",18190100,"0036385485"]
[98,"X TK 1-31",31,"X TK 1","RIFDA NUR SHINTA",18190101,"0020564695"]
[99,"X TK 1-32",32,"X TK 1","RIFKI IRAWAN",18190102,"0028772684"]
[100,"X TK 1-33",33,"X TK 1","RIYAN HIDAYAT",18190103,"0035151107"]
[101,"X TK 1-34",34,"X TK 1","SILVYIANIH KARDIAH",18190104,"0028931086"]
[102,"X TK 1-35",35,"X TK 1","TEGAR NUGRAHA",18190105,"0031129106"]
[103,"X TK 1-36",36,"X TK 1","ZENITHA PUJI KHAIRINA",18190106,"0033297000"]
[104,"X TK 2-1",1,"X TK 2","AHMAD HIDAYAT",18190107,"0037381970"]
[105,"X TK 2-2",2,"X TK 2","ALDY RIVALDY DE FRETES",18190108,"0039425024"]
[106,"X TK 2-3",3,"X TK 2","ALVINDRA PUTRA ARDHANA",18190109,"0033297054"]
[107,"X TK 2-4",4,"X TK 2","AMAR ASSHIDDIQIE HIDAYAT",18190110,"0021220841"]
[108,"X TK 2-5",5,"X TK 2","ANDIKA DWI PAMUNGKAS",18190111,"0031971571"]
[109,"X TK 2-6",6,"X TK 2","ARIF FIRDAOS",18190112,"0040430429"]
[110,"X TK 2-7",7,"X TK 2","DANI FRASETIA",18190113,"0026915433"]
[111,"X TK 2-8",8,"X TK 2","DEDY RAHMAT",18190114,"0026612814"]
[112,"X TK 2-9",9,"X TK 2","DHANUAR HUSSEIN",18190115,"0035957359"]
[113,"X TK 2-10",10,"X TK 2","DIDI MULYADI",18190116,"0034518526"]
[114,"X TK 2-11",11,"X TK 2","FADLI AJRILANA AHMAD",18190117,"0039705028"]
[115,"X TK 2-12",12,"X TK 2","FAHRUL MUAZID",18190118,"0033395000"]
[116,"X TK 2-13",13,"X TK 2","FAUZAN LUQMANUL HAKIM",18190119,"0039219892"]
[117,"X TK 2-14",14,"X TK 2","FIKRI RAFI PRATAMA ABDUL KADIR",18190120,"0026063513"]
[118,"X TK 2-15",15,"X TK 2","IBNU PADILAH",18190121,"0039781225"]
[119,"X TK 2-16",16,"X TK 2","IRFAN",18190122,"0033246285"]
[120,"X TK 2-17",17,"X TK 2","IZUMI ZAHRA HARIRY",18190123,"0042995074"]
[121,"X TK 2-18",18,"X TK 2","JAY MAULANA",18190124,"0035862559"]
[122,"X TK 2-19",19,"X TK 2","JEREMIA LEONARDO HUTASOIT",18190125,"0022126206"]
[123,"X TK 2-20",20,"X TK 2","KUNNIATUZ ZAHRA FIRDAUSI",18190126,"0036944087"]
[124,"X TK 2-21",21,"X TK 2","MUHAMAD RAKA MAULANA ZULKARNAEN",18190127,"0038657650"]
[125,"X TK 2-22",22,"X TK 2","MUHAMAD ROSIDI",18190128,"0032834145"]
[126,"X TK 2-23",23,"X TK 2","MUHAMMAD FARIZ ALVIANTO",18190129,"0026612794"]
[127,"X TK 2-24",24,"X TK 2","MUHAMMAD RIZKI ALAMSYAH",18190130,"0035269974"]
[128,"X TK 2-25",25,"X TK 2","NURDINA RAHMI",18190132,"0033181044"]
[129,"X TK 2-26",26,"X TK 2","PEBRIYANTI KUSNADI PRATIWI",18190133,"0034460885"]
[130,"X TK 2-27",27,"X TK 2","RAMDHANI RAFI TRIE MAULANA",18190134,"0034779899"]
[{"$f":"A132+1","v":131},{"$f":"D133&\"-\"&C133","v":"X TK 2-28"},{"$f":"IF(D132=D133,C132+1,1)","v":28},"X TK 2","RISKY RAHMAWATI",18190135,"0039126570"]
[132,"X TK 2-29",29,"X TK 2","RIZKY AGUNG RAMADHAN",18190136,"0022781741"]
[133,"X TK 2-30",30,"X TK 2","RIZKY PRATAMA",18190137,"0035503179"]
[134,"X TK 2-31",31,"X TK 2","SITI KHOERUNISA",18190138,"0032615747"]
[135,"X TK 2-32",32,"X TK 2","SUPRIYATNA",18190139,"0035126576"]
[136,"X TK 2-33",33,"X TK 2","TEGAR MAULANA ISHAK",18190140,"0029791431"]
[137,"X TK 2-34",34,"X TK 2","TITA APRIANTI",18190141,"0034997753"]
[138,"X TK 2-35",35,"X TK 2","TRI SALISTIA PEBRIAN",18190142,"0034966763"]
[139,"X TM 1-1",1,"X TM 1","AHMAD FAJAR SAEFUDIN",18190143,"0033315735"]
[140,"X TM 1-2",2,"X TM 1","AHMAD NURYUSUP HANAFI",18190144,"0039678050"]
[141,"X TM 1-3",3,"X TM 1","ALFAN GOFUR",18190145,"0028555270"]
[142,"X TM 1-4",4,"X TM 1","ARIEL FERDIANSYAH",18190146,"0024435312"]
[143,"X TM 1-5",5,"X TM 1","CEPI ARIS",18190147,"0021323779"]
[144,"X TM 1-6",6,"X TM 1","CITA RAMDAN",18190148,"0029197980"]
[145,"X TM 1-7",7,"X TM 1","DIAS PRASSETIO PADILAH",18190149,"0039019415"]
[146,"X TM 1-8",8,"X TM 1","DIDIK YULIANTO",18190150,"0025503684"]
[147,"X TM 1-9",9,"X TM 1","DWI RAHARJO",18190151,"0026255456"]
[148,"X TM 1-10",10,"X TM 1","DZULFIQRY",18190152,"0033297086"]
[149,"X TM 1-11",11,"X TM 1","HAPID JANUAR SYAPUTRA",18190153,"0028198001"]
[150,"X TM 1-12",12,"X TM 1","INDRA CIPTAWIJAYA",18190154,"0030498171"]
[151,"X TM 1-13",13,"X TM 1","IRVAN MAULANA",18190155,"0026559889"]
[152,"X TM 1-14",14,"X TM 1","JAJANG",18190156,"0027367097"]
[153,"X TM 1-15",15,"X TM 1","JODI NUGRAHA",18190157,"0032516550"]
[154,"X TM 1-16",16,"X TM 1","KARTIKA ASIH",18190158,"0033771819"]
[155,"X TM 1-17",17,"X TM 1","MOCHAMAD ALFIAN ALPARIZKI",18190159,"0035628027"]
[156,"X TM 1-18",18,"X TM 1","MOCHAMAD ANDRE FITRIYANTO",18190160,"0026255452"]
[157,"X TM 1-19",19,"X TM 1","MUHAMAD FAJAR RIYANTO",18190161,"0020922742"]
[158,"X TM 1-20",20,"X TM 1","MUHAMMAD ARI ALFARIZI",18190162,"0034846486"]
[159,"X TM 1-21",21,"X TM 1","MUHAMMAD DAFA NURHIDAYAT",18190163,"0036799957"]
[160,"X TM 1-22",22,"X TM 1","MUHAMMAD RIZAL NUR AKBAR",18190164,"0039081270"]
[161,"X TM 1-23",23,"X TM 1","MUHAMMAD YAZID FADHILLAH",18190165,"0034883253"]
[162,"X TM 1-24",24,"X TM 1","NANANG KURMANI",18190166,"0031509468"]
[163,"X TM 1-25",25,"X TM 1","RADEN RIZKI RAFI ARISSAPUTRA",18190167,"0034573805"]
[164,"X TM 1-26",26,"X TM 1","RAFA NAUFAL ISHAM SUBHANA",18190168,"0038219075"]
[165,"X TM 1-27",27,"X TM 1","RAFLY RIYADHUL NUR SYAFWAN",18190169,"0037012723"]
[166,"X TM 1-28",28,"X TM 1","RAIHAN RAMDHANI",18190170,"0023183214"]
[167,"X TM 1-29",29,"X TM 1","REZA AFRIANSYAH",18190171,"0026255054"]
[168,"X TM 1-30",30,"X TM 1","SARIP HIDAYAT",18190172,"0032615741"]
[169,"X TM 1-31",31,"X TM 1","SULIS SETIO HADI",18190173,"0036297287"]
[170,"X TM 1-32",32,"X TM 1","TAOFIK BILLAHI",18190174,"0039663421"]
[171,"X TM 1-33",33,"X TM 1","TEDI SETIADI",18190175,"0038705461"]
[172,"X TM 1-34",34,"X TM 1","TISNA SAHRUN",18190176,"0038397476"]
[173,"X TM 1-35",35,"X TM 1","WAHYU RAMDHANI",18190177,"0023111975"]
[174,"X TM 1-36",36,"X TM 1","WINDA LISTIANI",18190178,"0027543098"]
[175,"X TM 2-1",1,"X TM 2","ADI KARYA HUSADA",18190179,"0028312577"]
[176,"X TM 2-2",2,"X TM 2","AHMAD MUAZIR",18190180,"0021085373"]
[177,"X TM 2-3",3,"X TM 2","AHMAD SHOIMUN DZULFIQOR",18190181,"0046675202"]
[178,"X TM 2-4",4,"X TM 2","AKBAR NUR ALHAEN",18190182,"0033297352"]
[179,"X TM 2-5",5,"X TM 2","ALDIE SHEVA SUGARA",18190183,"0003167888"]
[180,"X TM 2-6",6,"X TM 2","ALVIN KAKA YUDISTIRA",18190184,"0044270357"]
[181,"X TM 2-7",7,"X TM 2","ANJANI SYAWALIYAH",18190185,"0024114474"]
[182,"X TM 2-8",8,"X TM 2","DANDI KUSWARA",18190186,"0031046477"]
[183,"X TM 2-9",9,"X TM 2","DENA FIRMANSYAH",18190187,"0022409377"]
[184,"X TM 2-10",10,"X TM 2","EDI GUNAWAN",18190188,"0028854701"]
[185,"X TM 2-11",11,"X TM 2","FAUZI RAKA PRATAMA",18190189,"0037925648"]
[186,"X TM 2-12",12,"X TM 2","FERDINATA",18190190,"0028964558"]
[187,"X TM 2-13",13,"X TM 2","FIKRI ANISAH",18190191,"0025006576"]
[188,"X TM 2-14",14,"X TM 2","FRANSISKUS SITOHANG",18190192,"0022292984"]
[189,"X TM 2-15",15,"X TM 2","HERI SETIAWAN",18190193,"0035740047"]
[190,"X TM 2-16",16,"X TM 2","ILYAS TIA FIRMANSYAH",18190194,"0035168648"]
[191,"X TM 2-17",17,"X TM 2","INDRA PERMANA",18190195,"0031722734"]
[192,"X TM 2-18",18,"X TM 2","JODI ADITTYA INDRAWAN",18190196,"0025129558"]
[193,"X TM 2-19",19,"X TM 2","MARIAH",18190197,"0044105309"]
[194,"X TM 2-20",20,"X TM 2","MUHAMAD ABDURROHIM",18190198,"0047858895"]
[{"$f":"A196+1","v":195},{"$f":"D197&\"-\"&C197","v":"X TM 2-21"},{"$f":"IF(D196=D197,C196+1,1)","v":21},"X TM 2","MUHAMAD IRFAN",18190199,"0036080982"]
[196,"X TM 2-22",22,"X TM 2","MUHAMMAD RIZKI  RAMADHAN",18190200,"0031729443"]
[197,"X TM 2-23",23,"X TM 2","MUHAMMAD SHOLIHUDIN",18190201,"0032490632"]
[198,"X TM 2-24",24,"X TM 2","PADLI APRIYANA",18190202,"0036387827"]
[199,"X TM 2-25",25,"X TM 2","RAFLY HIDAYAT",18190203,"0039014192"]
[200,"X TM 2-26",26,"X TM 2","RAYHAN RAMADAN",18190204,"0034128655"]
[201,"X TM 2-27",27,"X TM 2","RIVAN MAULANA",18190205,"0038733517"]
[202,"X TM 2-28",28,"X TM 2","SAIFUL ANWAR",18190206,"0033788525"]
[203,"X TM 2-29",29,"X TM 2","SANJAYA",18190207,"0036810002"]
[204,"X TM 2-30",30,"X TM 2","SARAS RAMDIANI",18190208,"0025804469"]
[205,"X TM 2-31",31,"X TM 2","SITI MAELA",18190209,"0026664547"]
[206,"X TM 2-32",32,"X TM 2","SITI RAMDHANA QIBTIYAH",18190210,"0034756256"]
[207,"X TM 2-33",33,"X TM 2","SUDIMAN",18190211,"0012960859"]
[208,"X TM 2-34",34,"X TM 2","WAHYUDIN",18190212,"0030498180"]
[209,"X TM 2-35",35,"X TM 2","WILDIANTARA DERMAWAN",18190213,"0028401107"]
[210,"X TM 2-36",36,"X TM 2","WINATA",18190214,"0039569364"]
[211,"X TM 3-1",1,"X TM 3","ADAM LUTHVI",18190215,"0037154443"]
[212,"X TM 3-2",2,"X TM 3","AGIL NURFAMUNGKAS",18190216,"0038729303"]
[213,"X TM 3-3",3,"X TM 3","AHMAD FURQON RAMADHANI",18190217,"0034711988"]
[214,"X TM 3-4",4,"X TM 3","ALIFIAN RIZKIE NUGRAHA",18190218,"0020908111"]
[215,"X TM 3-5",5,"X TM 3","ANDRE AGUSTIAN",18190219,"0020923990"]
[216,"X TM 3-6",6,"X TM 3","ANISA NOVITASARI",18190220,"0020908672"]
[217,"X TM 3-7",7,"X TM 3","ARDIAN RUSWANDI",18190221,"0021584349"]
[218,"X TM 3-8",8,"X TM 3","ARI FIRMANSYAH",18190222,"0021321165"]
[219,"X TM 3-9",9,"X TM 3","DADAN RUSDIANA",18190224,"0029380595"]
[220,"X TM 3-10",10,"X TM 3","DANIEL SETIONO",18190225,"0035164623"]
[221,"X TM 3-11",11,"X TM 3","DENI RAMADHAN",18190226,"0023223738"]
[222,"X TM 3-12",12,"X TM 3","DENNY SETIAWAN",18190227,"0021260409"]
[223,"X TM 3-13",13,"X TM 3","DIAN PERMANA",18190228,"0026842805"]
[224,"X TM 3-14",14,"X TM 3","DIAZ FATHUL AZIZ",18190229,"0036177982"]
[225,"X TM 3-15",15,"X TM 3","DIKI DARMAWAN",18190230,"0025534332"]
[226,"X TM 3-16",16,"X TM 3","HELLMI IBRAHIM",18190231,"0034445134"]
[227,"X TM 3-17",17,"X TM 3","IMAM TEGUH PRAKOSO",18190232,"0039921510"]
[228,"X TM 3-18",18,"X TM 3","IRGI ANDRIAN",18190233,"0024435327"]
[229,"X TM 3-19",19,"X TM 3","JUHARI MAKNUN",18190234,"0041441472"]
[230,"X TM 3-20",20,"X TM 3","MOCHAMAD RYAN PRASETYA",18190235,"0025938608"]
[231,"X TM 3-21",21,"X TM 3","MUHAMAD RISKY",18190236,"0036919718"]
[232,"X TM 3-22",22,"X TM 3","MUHAMMAD ANAM FIRDAUS",18190237,"0033875152"]
[233,"X TM 3-23",23,"X TM 3","MUHAMMAD ARIQ RABBANI",18190238,"0037808932"]
[234,"X TM 3-24",24,"X TM 3","MUHAMMAD FAWWAZ AMRULLAH",18190239,"0034120721"]
[235,"X TM 3-25",25,"X TM 3","MUHAMMAD SAYFULAH",18190242,"0036244626"]
[236,"X TM 3-26",26,"X TM 3","MULYANA",18190243,"0023609810"]
[237,"X TM 3-27",27,"X TM 3","NENENG SUMARNI",18190244,"0030065649"]
[238,"X TM 3-28",28,"X TM 3","NURKOMALA",18190245,"0038677824"]
[239,"X TM 3-29",29,"X TM 3","RANGGA ADITYA",18190246,"0038657645"]
[240,"X TM 3-30",30,"X TM 3","SACHEL ALIANSYAH YUSRON",18190247,"0031196822"]
[241,"X TM 3-31",31,"X TM 3","WANDY JAELANY",18190248,"0034244513"]
[242,"X TM 3-32",32,"X TM 3","YOLA DWIYANA",18190249,"0034307631"]
[243,"X TM 3-33",33,"X TM 3","ZHAROTUL ZHAHARA",18190250,"0039511051"]
[244,"X TM 4-1",1,"X TM 4","ABILAH DAMARA",18190251,"0020920612"]
[245,"X TM 4-2",2,"X TM 4","AHMAD BAYHAQI",18190252,"0036086448"]
[246,"X TM 4-3",3,"X TM 4","ANDRA RAMADHAN",18190253,"0039294010"]
[247,"X TM 4-4",4,"X TM 4","APRIYADI PERMANA",18190254,"0022355280"]
[248,"X TM 4-5",5,"X TM 4","ARIANSYAH SUBANDRIO",18190255,"0032834193"]
[249,"X TM 4-6",6,"X TM 4","AZHAR FAUZAN",18190256,"0033055255"]
[250,"X TM 4-7",7,"X TM 4","AZHAR FAUZI",18190257,"0036177986"]
[251,"X TM 4-8",8,"X TM 4","BAHRUDIN",18190258,"0028808880"]
[252,"X TM 4-9",9,"X TM 4","CANDRA SANTIKA",18190259,"0028278323"]
[253,"X TM 4-10",10,"X TM 4","DANDI KUSUMA",18190260,"0037146707"]
[254,"X TM 4-11",11,"X TM 4","DANI MAULANA",18190261,"0038326751"]
[255,"X TM 4-12",12,"X TM 4","DEDE ADI HARYANTO",18190262,"0020923999"]
[256,"X TM 4-13",13,"X TM 4","DEDI ISKANDAR",18190263,"0036981475"]
[257,"X TM 4-14",14,"X TM 4","DELVINO BRYAN VARELL",18190264,"0022293033"]
[258,"X TM 4-15",15,"X TM 4","DIMAS EKADITYA HUTAMA",18190265,"0020908102"]
[{"$f":"A260+1","v":259},{"$f":"D261&\"-\"&C261","v":"X TM 4-16"},{"$f":"IF(D260=D261,C260+1,1)","v":16},"X TM 4","IMAM SUTANTO",18190266,"0021980670"]
[260,"X TM 4-17",17,"X TM 4","IRWAN CANDRA",18190267,"0036773139"]
[261,"X TM 4-18",18,"X TM 4","KURNIA PIQI SYAWALUDIN",18190268,"0021627955"]
[262,"X TM 4-19",19,"X TM 4","LUKMAN HAKIM ALAMSYAH",18190269,"0023767695"]
[263,"X TM 4-20",20,"X TM 4","MISTA",18190270,"0027484028"]
[264,"X TM 4-21",21,"X TM 4","MOCHAMAD ROBBI ALAYYA",18190271,"0028006925"]
[265,"X TM 4-22",22,"X TM 4","MUHAMAD RIDWAN",18190272,"0036761039"]
[266,"X TM 4-23",23,"X TM 4","MUHAMAD RIZKI MAULANA",18190273,"0032491435"]
[267,"X TM 4-24",24,"X TM 4","MUHAMAD WAHYU ARIPUDDIN",18190274,"0024500526"]
[268,"X TM 4-25",25,"X TM 4","MUHAMMAD FARIZ HASHFI",18190275,"0036217259"]
[269,"X TM 4-26",26,"X TM 4","MUHAMMAD RIZKI WAHYUDIN",18190276,"0036850906"]
[270,"X TM 4-27",27,"X TM 4","MUHAMMAD ZIDAN TAUFIK",18190277,"0027264681"]
[271,"X TM 4-28",28,"X TM 4","NUR GAMAR WAHFIUDIN",18190278,"0035653583"]
[272,"X TM 4-29",29,"X TM 4","RAFLI RAMDHANI",18190279,"0035264453"]
[273,"X TM 4-30",30,"X TM 4","RIZKY SULAEMAN",18190280,"0031043980"]
[274,"X TM 4-31",31,"X TM 4","SAHIDIN NURBUAT",18190281,"0002523243"]
[275,"X TM 4-32",32,"X TM 4","SITI MAEMUNAH",18190282,"0039660312"]
[276,"X TM 4-33",33,"X TM 4","TEGUH WALUYA",18190283,"0039074015"]
[277,"X TM 4-34",34,"X TM 4","TITI SUMIATI",18190284,"0022289838"]
[278,"X TM 4-35",35,"X TM 4","TOPAN SOPYAN",18190285,"0023801642"]
[279,"X TM 4-36",36,"X TM 4","ZAENUDIN",18190286,"0005087041"]
[280,"X TM 5-1",1,"X TM 5","AGIN AHMAD GINANJAR",18190287,"0036697115"]
[281,"X TM 5-2",2,"X TM 5","AGUS MAHENDRA",18190288,"0032086884"]
[282,"X TM 5-3",3,"X TM 5","AGUSTIAN",18190289,"0029339938"]
[283,"X TM 5-4",4,"X TM 5","AKMAL SAEPUL",18190290,"0036342946"]
[284,"X TM 5-5",5,"X TM 5","ALAMSYAH",18190291,"0026277466"]
[285,"X TM 5-6",6,"X TM 5","ALI WARDANA",18190292,"0027129859"]
[286,"X TM 5-7",7,"X TM 5","ALIT DIAS PAMUNGKAS",18190293,"0039137766"]
[287,"X TM 5-8",8,"X TM 5","AMAR NAJI ABDULRAHMAN",18190294,"0032028780"]
[288,"X TM 5-9",9,"X TM 5","ANIN NURDIANSYAH",18190295,"0029069438"]
[289,"X TM 5-10",10,"X TM 5","ARI PASYA",18190296,"0039526119"]
[290,"X TM 5-11",11,"X TM 5","ASEP SOLIHIN",18190297,"0028959341"]
[291,"X TM 5-12",12,"X TM 5","DADANG SOBARI",18190298,"0026116549"]
[292,"X TM 5-13",13,"X TM 5","DENDI WAHYUDI",18190299,"0039237001"]
[293,"X TM 5-14",14,"X TM 5","DENISA WIDAYANTI",18190300,"0019975642"]
[294,"X TM 5-15",15,"X TM 5","DENY IRAWAN",18190301,"0024743591"]
[295,"X TM 5-16",16,"X TM 5","DIMAS ISKANDAR",18190302,"0036920286"]
[296,"X TM 5-17",17,"X TM 5","DINDIN PATONI",18190303,"0018651468"]
[297,"X TM 5-18",18,"X TM 5","FAISAL SEPTIANA",18190304,"0039535595"]
[298,"X TM 5-19",19,"X TM 5","FARELL AL AZRIEL",18190305,"0021464040"]
[299,"X TM 5-20",20,"X TM 5","KIKI DIMAS PRAYOGA",18190306,"0036508859"]
[300,"X TM 5-21",21,"X TM 5","KIKI OKTAVIA",18190307,"0035042133"]
[301,"X TM 5-22",22,"X TM 5","MARWAN FADILAH",18190309,"0027173584"]
[302,"X TM 5-23",23,"X TM 5","MUHAMAD AME",18190310,"0022080650"]
[303,"X TM 5-24",24,"X TM 5","MUHAMAD FADILAH",18190311,"0034153430"]
[304,"X TM 5-25",25,"X TM 5","MUHAMMAD ALFAN",18190312,"0048775669"]
[305,"X TM 5-26",26,"X TM 5","MUHAMMAD FIAN AZILAH",18190313,"0035157104"]
[306,"X TM 5-27",27,"X TM 5","MUHAMMAD HAFIZ FAUZI",18190314,"0038458976"]
[307,"X TM 5-28",28,"X TM 5","RAFFI AHMAD",18190315,"0036850876"]
[308,"X TM 5-29",29,"X TM 5","RAFI KRESNA MUKTI",18190316,"0030065566"]
[309,"X TM 5-30",30,"X TM 5","RIFALDI NUGRAHA PUTRA",18190317,"0029348084"]
[310,"X TM 5-31",31,"X TM 5","ROMALULOH",18190318,"0025706180"]
[311,"X TM 5-32",32,"X TM 5","SUKARDI",18190319,"0026277350"]
[312,"X TM 5-33",33,"X TM 5","UMAR RAMDHANI",18190320,"0032490664"]
[313,"X TM 5-34",34,"X TM 5","WALIM WIJAYA",18190321,"0033055745"]
[314,"X TM 5-35",35,"X TM 5","WILI GUMILAR",18190322,"0029462600"]
[315,"X TM 6-1",1,"X TM 6","ADIRA NUGRAHA HIDAYAT",18190323,"0030065651"]
[316,"X TM 6-2",2,"X TM 6","ADITIYA ARYA SAPUTRA",18190324,"0021723708"]
[317,"X TM 6-3",3,"X TM 6","AFIF RIFAI",18190325,"0023541786"]
[318,"X TM 6-4",4,"X TM 6","AKAS ILHAMI",18190326,"0034598611"]
[319,"X TM 6-5",5,"X TM 6","AKBAR MAULANA",18190327,"0028931058"]
[320,"X TM 6-6",6,"X TM 6","ALDY NUR RAMADHAN",18190328,"0028658982"]
[321,"X TM 6-7",7,"X TM 6","ANDRIAN JULIANTO",18190329,"0031629707"]
[322,"X TM 6-8",8,"X TM 6","ANDRIYANA",18190330,"0038863520"]
[{"$f":"A324+1","v":323},{"$f":"D325&\"-\"&C325","v":"X TM 6-9"},{"$f":"IF(D324=D325,C324+1,1)","v":9},"X TM 6","AZZAHRA RIZKA KAMALIA",18190331,"0034779898"]
[324,"X TM 6-10",10,"X TM 6","BAGAS KOSASIH",18190332,"0033394806"]
[325,"X TM 6-11",11,"X TM 6","DEDE DESIH",18190333,"0029200476"]
[326,"X TM 6-12",12,"X TM 6","DEDE LUKMAN",18190334,"0029719755"]
[327,"X TM 6-13",13,"X TM 6","FAIRLY YAMA ESA NUSVIA",18190335,"0034779774"]
[328,"X TM 6-14",14,"X TM 6","HERU RUZAL FARHAN",18190337,"0034505376"]
[329,"X TM 6-15",15,"X TM 6","ILHAM MUBAROK",18190338,"          "]
[330,"X TM 6-16",16,"X TM 6","JULIAN RIZKI",18190339,"0034880887"]
[331,"X TM 6-17",17,"X TM 6","LUIS WALIH SAPUTRA",18190340,"0036738480"]
[332,"X TM 6-18",18,"X TM 6","M. FADILLA AKBAR",18190341,"0034928476"]
[333,"X TM 6-19",19,"X TM 6","MARYANI",18190342,"0028602956"]
[334,"X TM 6-20",20,"X TM 6","MOHAMAD JOHAN",18190343,"0038459035"]
[335,"X TM 6-21",21,"X TM 6","MUHAMAD ALFARIZQI",18190344,"0037306077"]
[336,"X TM 6-22",22,"X TM 6","MUHAMAD FIRZA FIRDAUS",18190345,"0038733589"]
[337,"X TM 6-23",23,"X TM 6","MUHAMMAD FARHAN",18190346,"0038091925"]
[338,"X TM 6-24",24,"X TM 6","NOUFAL SATRIA RAMADHAN",18190347,"0028658981"]
[339,"X TM 6-25",25,"X TM 6","RAIHAN FAUZAN ADZHARY",18190348,"0038085453"]
[340,"X TM 6-26",26,"X TM 6","RAKA ADITYA ARIEF",18190349,"0035435483"]
[341,"X TM 6-27",27,"X TM 6","RAY RAMADHONA ASKOLANI",18190350,"0038554279"]
[342,"X TM 6-28",28,"X TM 6","RENDY PRATAMA PUTRA",18190351,"0031586425"]
[343,"X TM 6-29",29,"X TM 6","REZA PAHLEVI IRIANTO",18190352,"0035895156"]
[344,"X TM 6-30",30,"X TM 6","RIKI APRIATNA CRISTIAN PUTRA",18190353,"0035182681"]
[345,"X TM 6-31",31,"X TM 6","RISAL PRASETYO",18190354,"0027345218"]
[346,"X TM 6-32",32,"X TM 6","TATA SOMANTRI",18190355,"0029101929"]
[347,"X TM 6-33",33,"X TM 6","YOGIANA SULTAN PRADISTIRA",18190356,"0020187158"]
[348,"X TM 6-34",34,"X TM 6","YUNITA ALTIANA",18190357,"0036850865"]
[349,"X TM 6-35",35,"X TM 6","ABDUL ROJAK","17180385","0024112716"]
[350,"X TM 7-1",1,"X TM 7","AGUNG ESA RAMADHAN",18190358,"0027780910"]
[351,"X TM 7-2",2,"X TM 7","AHMAD SAUQI NAJIEB",18190359,"0032728232"]
[352,"X TM 7-3",3,"X TM 7","ALDI RIMANSYAH",18190360,"0033714068"]
[353,"X TM 7-4",4,"X TM 7","ALESSANDRO FERDHINAND HEDI SYAHPUTRA",18190361,"0026174763"]
[354,"X TM 7-5",5,"X TM 7","AMAD SOPIAN",18190362,"0026016183"]
[355,"X TM 7-6",6,"X TM 7","AZHAR MASHUDI",18190363,"0020101131"]
[356,"X TM 7-7",7,"X TM 7","DAMAYANTI FITRIANI",18190364,"0028958816"]
[357,"X TM 7-8",8,"X TM 7","DIAZ FIDEL RASYID",18190365,"0033209582"]
[358,"X TM 7-9",9,"X TM 7","DIMAS FAHREZI ZAENI",18190366,"0031688969"]
[359,"X TM 7-10",10,"X TM 7","EKA RIDWAN",18190367,"0030120210"]
[360,"X TM 7-11",11,"X TM 7","ELDIS SURYA MAHESURA",18190368,"0036773140"]
[361,"X TM 7-12",12,"X TM 7","FADLAN RAKIN AL FACHRI",18190369,"0033618310"]
[362,"X TM 7-13",13,"X TM 7","FARIS DZAKWAN",18190370,"0034779861"]
[363,"X TM 7-14",14,"X TM 7","FAUZI FAJRI AZZIKRI",18190371,"0024614004"]
[364,"X TM 7-15",15,"X TM 7","FIO FAJAR FIRMANSYAH",18190372,"0028762140"]
[365,"X TM 7-16",16,"X TM 7","GILANG RAIS RABBANI",18190373,"0031971576"]
[366,"X TM 7-17",17,"X TM 7","M NAUFAL FAQIH",18190374,"0033792434"]
[367,"X TM 7-18",18,"X TM 7","MIRA ADITRIANTI",18190375,"0035166552"]
[368,"X TM 7-19",19,"X TM 7","MUHAMMAD ALFIANA",18190376,"0033544332"]
[369,"X TM 7-20",20,"X TM 7","MUHAMMAD ALWI ASY'ARY",18190377,"0038657669"]
[370,"X TM 7-21",21,"X TM 7","MUHAMMAD TEGUH IMANTORO",18190378,"0034816858"]
[371,"X TM 7-22",22,"X TM 7","MUKHLIS SAPUTRA",18190379,"0038817950"]
[372,"X TM 7-23",23,"X TM 7","NUR KHOLIFFAH PRAYOGO",18190380,"0022364749"]
[373,"X TM 7-24",24,"X TM 7","RAFLI RAFSANJANI",18190381,"0036217267"]
[374,"X TM 7-25",25,"X TM 7","RESTU ADHITYA",18190382,"0040636937"]
[375,"X TM 7-26",26,"X TM 7","RIGWAN ADISAPUTRA",18190383,"0024114261"]
[376,"X TM 7-27",27,"X TM 7","RIRIN NOVIYANTRI",18190384,"0033771832"]
[377,"X TM 7-28",28,"X TM 7","SELLI BUDIARTI",18190385,"0037812715"]
[378,"X TM 7-29",29,"X TM 7","SYIFA PUTRI NURUSHAFAR",18190386,"0035442136"]
[379,"X TM 7-30",30,"X TM 7","SYLVIA WULANDARI",18190387,"0033725463"]
[380,"X TM 7-31",31,"X TM 7","TEDY LESMANA",18190388,"0030065538"]
[381,"X TM 7-32",32,"X TM 7","TRI DINA AMBAR PRIHARTINI",18190389,"0037782557"]
[382,"X TM 7-33",33,"X TM 7","WELDRY ADAM HARYADI",18190390,"0034779865"]
[383,"X TM 7-34",34,"X TM 7","YOGI YUDHIA PUTRA",18190391,"0032558468"]
[384,"X TM 7-35",35,"X TM 7","YULIA",18190392,"0036773143"]
[385,"X TM 7-36",36,"X TM 7","ABDUL AZIS HAMDANI","17180384","0024114195"]
[386,"X TM 8-1",1,"X TM 8","ABDUL ROHIM",18190393,"0020101122"]
[{"$f":"A388+1","v":387},{"$f":"D389&\"-\"&C389","v":"X TM 8-2"},{"$f":"IF(D388=D389,C388+1,1)","v":2},"X TM 8","ACIP SAPUTRA",18190394,"0026510345"]
[388,"X TM 8-3",3,"X TM 8","ADJENG SURYA RARASHATY",18190395,"0036821858"]
[389,"X TM 8-4",4,"X TM 8","AGUS PERMANA",18190396,"0027589370"]
[390,"X TM 8-5",5,"X TM 8","AHMAD MUROBI",18190397,"0027150681"]
[391,"X TM 8-6",6,"X TM 8","ALPINA DAMAYANTI",18190398,"0035677015"]
[392,"X TM 8-7",7,"X TM 8","ANDI DWI PUTRA SUGIHARTO LATIF",18190399,"0022590383"]
[393,"X TM 8-8",8,"X TM 8","ANDRE DAMENDRA SAGALA",18190400,"0026443024"]
[394,"X TM 8-9",9,"X TM 8","CANDRA MAESA ZENAR",18190401,"0037206296"]
[395,"X TM 8-10",10,"X TM 8","DIAN MAULIDIN",18190402,"0032503686"]
[396,"X TM 8-11",11,"X TM 8","FAHRUL HERLAMBANG",18190403,"0033146468"]
[397,"X TM 8-12",12,"X TM 8","FATTAYA IVONY DINDA JALIMUN",18190404,"0033405984"]
[398,"X TM 8-13",13,"X TM 8","FIKRI MUHAMAD AZIS",18190405,"0020908096"]
[399,"X TM 8-14",14,"X TM 8","GANDA PURBA",18190406,"0049382775"]
[400,"X TM 8-15",15,"X TM 8","GILANG PRATAMA",18190407,"0035660751"]
[401,"X TM 8-16",16,"X TM 8","HILAL JAUHAR ISNAENI",18190408,"0024563665"]
[402,"X TM 8-17",17,"X TM 8","MARDIYANSYAH SANDI GUMILAR",18190409,"0038817813"]
[403,"X TM 8-18",18,"X TM 8","MAYA RIZKIENA KUSUMA JUWITA",18190410,"0039305593"]
[404,"X TM 8-19",19,"X TM 8","MOHAMAD FARID HADI",18190411,"0043878877"]
[405,"X TM 8-20",20,"X TM 8","MUHAMAD ABDUL AZIS",18190412,"0036483326"]
[406,"X TM 8-21",21,"X TM 8","MUHAMAD ABI FAHREJI",18190413,"0034834431"]
[407,"X TM 8-22",22,"X TM 8","MUHAMAD RANDI FADILLAH",18190414,"0038583979"]
[408,"X TM 8-23",23,"X TM 8","MUHAMAD ROBILIJATI",18190415,"0031984467"]
[409,"X TM 8-24",24,"X TM 8","MUHAMMAD FAUZAN HILAL",18190416,"0035678964"]
[410,"X TM 8-25",25,"X TM 8","MUHAMMAD FIKRI GELAR GUMILANG",18190417,"0038657662"]
[411,"X TM 8-26",26,"X TM 8","MUHAMMAD TIRTA NAJWAN",18190418,"0036885455"]
[412,"X TM 8-27",27,"X TM 8","MUHAMMAD ZIDAN KHOIRI MA'MUR",18190419,"0024652155"]
[413,"X TM 8-28",28,"X TM 8","NANDI APRIANTO",18190420,"0024114874"]
[414,"X TM 8-29",29,"X TM 8","NUNU NURFARIZI",18190421,"0026510738"]
[415,"X TM 8-30",30,"X TM 8","NUR FAIZAH SOLICHUDIN",18190422,"0034418284"]
[416,"X TM 8-31",31,"X TM 8","PASCHAL ABILY",18190423,"0027891034"]
[417,"X TM 8-32",32,"X TM 8","RIDWAN",18190424,"0026276737"]
[418,"X TM 8-33",33,"X TM 8","RIFQI MAULANA FAZRI",18190425,"0035261520"]
[419,"X TM 8-34",34,"X TM 8","ROIHAN NURDIKA YUSUF",18190426,"0031133990"]
[420,"X TM 8-35",35,"X TM 8","TIYAS REGI SETIAWAN SAPUTRA",18190427,"0032798340"]
[421,"X TO 1-1",1,"X TO 1","ABIZAR YANUAR",18190428,"0030498065"]
[422,"X TO 1-2",2,"X TO 1","ADAM SUKANDI",18190429,"0024295689"]
[423,"X TO 1-3",3,"X TO 1","AFTARIANUGRAHA YANUARWIJAYA",18190430,"0028464307"]
[424,"X TO 1-4",4,"X TO 1","AHMAD FAJAR MUBAHIR",18190431,"0023744242"]
[425,"X TO 1-5",5,"X TO 1","AKMAL NUGRAHA YUDA MANGGALA",18190432,"0026869339"]
[426,"X TO 1-6",6,"X TO 1","ALDI ALADAN",18190433,"0035137933"]
[427,"X TO 1-7",7,"X TO 1","ARDIANSYAH",18190434,"0031861410"]
[428,"X TO 1-8",8,"X TO 1","D. LELI TURSINA",18190435,"0039776672"]
[429,"X TO 1-9",9,"X TO 1","DADANG FARID",18190436,"          "]
[430,"X TO 1-10",10,"X TO 1","DIANA FITRIA SOLIHAT",18190438,"0028662896"]
[431,"X TO 1-11",11,"X TO 1","DIMAS RAMDHANI",18190439,"0034540092"]
[432,"X TO 1-12",12,"X TO 1","DINDA MAULIDIA",18190440,"0038801788"]
[433,"X TO 1-13",13,"X TO 1","DIWAN SUHENDI",18190441,"0023766270"]
[434,"X TO 1-14",14,"X TO 1","FAJAR ANWAR FADILAH",18190442,"0036738450"]
[435,"X TO 1-15",15,"X TO 1","FAUZAN RIZKIANSYAH",18190443,"0039518469"]
[436,"X TO 1-16",16,"X TO 1","FIKRI HAEKAL",18190444,"          "]
[437,"X TO 1-17",17,"X TO 1","GALIH FIRMANSYAH",18190445,"0038373042"]
[438,"X TO 1-18",18,"X TO 1","HARIS MUNANDAR",18190446,"0037179756"]
[439,"X TO 1-19",19,"X TO 1","JEFRY MISDIAN RAMADHANI",18190447,"0037879626"]
[440,"X TO 1-20",20,"X TO 1","KANTA WIJAYA",18190448,"0032494679"]
[441,"X TO 1-21",21,"X TO 1","KRESNA BAYU MUSTOPA",18190449,"0027695115"]
[442,"X TO 1-22",22,"X TO 1","MUHAMAD IRFAN FAUZI",18190450,"0034756204"]
[443,"X TO 1-23",23,"X TO 1","MUHAMMAD AZRIEL FEBRIAN",18190451,"0031863610"]
[444,"X TO 1-24",24,"X TO 1","MUHAMMAD EL BAAQI",18190452,"0032426439"]
[445,"X TO 1-25",25,"X TO 1","MUHAMMAD KHALID DINNAH",18190453,"0036476704"]
[446,"X TO 1-26",26,"X TO 1","MUHAMMAD KURNIA RIDHOLLAH",18190454,"0033297049"]
[447,"X TO 1-27",27,"X TO 1","MUHAMMAD NUR HIDAYATULLOH",18190455,"0028386528"]
[448,"X TO 1-28",28,"X TO 1","RAFI ADITIO NUGROHO",18190456,"0038678472"]
[449,"X TO 1-29",29,"X TO 1","REGA ADITIA",18190457,"0027938826"]
[450,"X TO 1-30",30,"X TO 1","REJA TAMAMI",18190458,"0030995235"]
[{"$f":"A452+1","v":451},{"$f":"D453&\"-\"&C453","v":"X TO 1-31"},{"$f":"IF(D452=D453,C452+1,1)","v":31},"X TO 1","RIZKI WAHYUDI",18190459,"0020564696"]
[452,"X TO 1-32",32,"X TO 1","SULTAN SIDQIE MUCHTAR",18190460,"0028194163"]
[453,"X TO 1-33",33,"X TO 1","WISNU JAYA",18190461,"0023182952"]
[454,"X TO 1-34",34,"X TO 1","WISNU NUGRAHA",18190462,"0026074369"]
[455,"X TO 1-35",35,"X TO 1","SATRIA RAFANSYAH",18190463,"0033529215"]
[456,"X TO 2-1",1,"X TO 2","ALFATH AKBAR PANGESTU",18190464,"0036799987"]
[457,"X TO 2-2",2,"X TO 2","AMIR PAISAL",18190465,"0029387461"]
[458,"X TO 2-3",3,"X TO 2","ANA ROHANA",18190466,"0024665358"]
[459,"X TO 2-4",4,"X TO 2","ANGELUS SAHAT MANGAPUL S",18190467,"0038554105"]
[460,"X TO 2-5",5,"X TO 2","ARDIANSAH",18190468,"0029167061"]
[461,"X TO 2-6",6,"X TO 2","ASEP WASNA",18190469,"0031628189"]
[462,"X TO 2-7",7,"X TO 2","BAGUS WIBOWO",18190470,"0035887298"]
[463,"X TO 2-8",8,"X TO 2","DELIA . F. SRIYANTI",18190471,"0023984464"]
[464,"X TO 2-9",9,"X TO 2","DIANA WULANSARI",18190472,"0034665099"]
[465,"X TO 2-10",10,"X TO 2","DIMAS ARIO FIRMANSYAH",18190473,"0039446602"]
[466,"X TO 2-11",11,"X TO 2","FERNANDA DENIRA FAJAR",18190474,"0032435228"]
[467,"X TO 2-12",12,"X TO 2","FIBRA PRASETYA",18190475,"0033500935"]
[468,"X TO 2-13",13,"X TO 2","GILAND DHARMAWAN AGUSTHIN",18190476,"0027718239"]
[469,"X TO 2-14",14,"X TO 2","HADLI FERDIANSAH",18190477,"0028151584"]
[470,"X TO 2-15",15,"X TO 2","ITANIAR",18190478,"0038735448"]
[471,"X TO 2-16",16,"X TO 2","MARWAN KOMARUDIN",18190479,"0024435515"]
[472,"X TO 2-17",17,"X TO 2","MOHAMAD KAMALUDIN LUKMAN",18190480,"0028465426"]
[473,"X TO 2-18",18,"X TO 2","MUHAMAD RIZKI FADILAH",18190481,"0028139849"]
[474,"X TO 2-19",19,"X TO 2","MUHAMAD ZARKASIH",18190482,"0013834274"]
[475,"X TO 2-20",20,"X TO 2","MUHAMMAD CECEP SUPRIYADI",18190483,"0039836101"]
[476,"X TO 2-21",21,"X TO 2","MUHAMMAD DAFFA ALBANI PRATIWA",18190484,"0033544350"]
[477,"X TO 2-22",22,"X TO 2","MUHAMMAD ILHAM TAJUL ARIFIN",18190485,"0031971602"]
[478,"X TO 2-23",23,"X TO 2","MUHAMMAD RAKHSAN SETIA DAFFANDA",18190486,"0029508218"]
[479,"X TO 2-24",24,"X TO 2","MUHAMMAD RIZKY ZAIDAN TARIGAN",18190487,"0016843908"]
[480,"X TO 2-25",25,"X TO 2","NATA",18190488,"0034082180"]
[481,"X TO 2-26",26,"X TO 2","RIDWAN MAULANA",18190489,"0035137932"]
[482,"X TO 2-27",27,"X TO 2","RIFQI NOVA RAMADHAN",18190490,"0033263626"]
[483,"X TO 2-28",28,"X TO 2","RIKI AGUS FAUZI",18190491,"0032504959"]
[484,"X TO 2-29",29,"X TO 2","RIZALDI LUTHFI RAMADHAN",18190492,"0034518543"]
[485,"X TO 2-30",30,"X TO 2","RIZKI SEPIYAN PUTRA",18190493,"0028911960"]
[486,"X TO 2-31",31,"X TO 2","ROMLAH",18190494,"0037978506"]
[487,"X TO 2-32",32,"X TO 2","RUDI BAYU HANANDI",18190495,"0012023344"]
[488,"X TO 2-33",33,"X TO 2","SENDY DWI PERMANA",18190496,"0039571656"]
[489,"X TO 2-34",34,"X TO 2","SUNARDI",18190497,"0032820282"]
[490,"X TO 2-35",35,"X TO 2","SUPARMAN",18190498,"0029644902"]
[491,"X TO 2-36",36,"X TO 2","YUSRIL WAHFIUDIN",18190499,"0034579868"]
[492,"X TO 3-1",1,"X TO 3","ANDI REKSO ADITYA",18190500,"0038556620"]
[493,"X TO 3-2",2,"X TO 3","ANUGRAH AKMAL JUNIOR",18190501,"0015785309"]
[494,"X TO 3-3",3,"X TO 3","ANZILA RAMDHANI",18190503,"0020945963"]
[495,"X TO 3-4",4,"X TO 3","ARI NURDIANSAH",18190504,"0038675136"]
[496,"X TO 3-5",5,"X TO 3","ARIS",18190505,"0027788146"]
[497,"X TO 3-6",6,"X TO 3","CHRYSTIAN ARYA FADLY",18190506,"0020924004"]
[498,"X TO 3-7",7,"X TO 3","DENI PAHRIJAL",18190507,"0026912435"]
[499,"X TO 3-8",8,"X TO 3","DICKY RIDWANULLOH MATHLUBY",18190508,"0036887749"]
[500,"X TO 3-9",9,"X TO 3","DIMAS PRAYOGA",18190509,"0045794374"]
[501,"X TO 3-10",10,"X TO 3","FATHUR RAHMAN RIZKI",18190510,"0035299421"]
[502,"X TO 3-11",11,"X TO 3","INA SUSILAWATI",18190511,"0034968583"]
[503,"X TO 3-12",12,"X TO 3","JUMIANDO IRFAN SINAGA",18190512,"0035461057"]
[504,"X TO 3-13",13,"X TO 3","M. SYAFIQ HIDAYAT",18190513,"0035137849"]
[505,"X TO 3-14",14,"X TO 3","MUHAMAD SANDRIYA",18190514,"0036476670"]
[506,"X TO 3-15",15,"X TO 3","MUHAMMAD BERDY ANUGRAH",18190515,"0039386664"]
[507,"X TO 3-16",16,"X TO 3","MUHAMMAD IKHWAN",18190516,"0038022904"]
[508,"X TO 3-17",17,"X TO 3","MUHAMMAD RIFA FIRDAUS",18190517,"0033055402"]
[509,"X TO 3-18",18,"X TO 3","PADIL ABDULAH",18190518,"0038817997"]
[510,"X TO 3-19",19,"X TO 3","FIQIH ADITYA PUTRA",18190519,"0029016758"]
[511,"X TO 3-20",20,"X TO 3","PUTRA ADHYAS SAHIRA",18190520,"0037716870"]
[512,"X TO 3-21",21,"X TO 3","PUTRA BAGAS ADITYA",18190521,"0036173130"]
[513,"X TO 3-22",22,"X TO 3","RADEN",18190522,"0032252877"]
[514,"X TO 3-23",23,"X TO 3","RAIHAN PRADIVA ANANDA",18190523,"0047956528"]
[{"$f":"A516+1","v":515},{"$f":"D517&\"-\"&C517","v":"X TO 3-24"},{"$f":"IF(D516=D517,C516+1,1)","v":24},"X TO 3","RAYHAN TAUFIQUL HAKIM",18190524,"0037533967"]
[516,"X TO 3-25",25,"X TO 3","RINI",18190525,"0032527506"]
[517,"X TO 3-26",26,"X TO 3","RIVAN DWI YULIANDRA",18190526,"0036918489"]
[518,"X TO 3-27",27,"X TO 3","RIZAL AWALUDIN",18190527,"0037409406"]
[519,"X TO 3-28",28,"X TO 3","RIZKI HERYADI RUSLI",18190528,"0026991059"]
[520,"X TO 3-29",29,"X TO 3","RIZKY SAMUEL NABABAN",18190529,"0033969525"]
[521,"X TO 3-30",30,"X TO 3","SYAHRUL ABDULOH",18190531,"0028931052"]
[522,"X TO 3-31",31,"X TO 3","TAUFIK MAULANA SAMSUDIN",18190532,"0039440330"]
[523,"X TO 3-32",32,"X TO 3","TENDI MUHAMMAD",18190533,"0036850854"]
[524,"X TO 3-33",33,"X TO 3","WIRAT",18190535,"0036850908"]
[525,"X TO 4-1",1,"X TO 4","ADAM PRASETYO",18190536,"0030145446"]
[526,"X TO 4-2",2,"X TO 4","ADITYA HERAWAN",18190537,"0028955481"]
[527,"X TO 4-3",3,"X TO 4","AGUNG BAROKAH",18190538,"0038052732"]
[528,"X TO 4-4",4,"X TO 4","AHMAD RAMDANI SONJAYA",18190539,"0036671680"]
[529,"X TO 4-5",5,"X TO 4","ALFIAN ISKANDAR",18190540,"0037244671"]
[530,"X TO 4-6",6,"X TO 4","ARIS APRIAWAN",18190541,"0001942453"]
[531,"X TO 4-7",7,"X TO 4","ARMAN MAULANA",18190542,"0033771803"]
[532,"X TO 4-8",8,"X TO 4","AZIS SYAHRUN JAMHI",18190543,"0020920614"]
[533,"X TO 4-9",9,"X TO 4","BUDI SALAMET",18190544,"0015947464"]
[534,"X TO 4-10",10,"X TO 4","CAHYATI",18190545,"0039553535"]
[535,"X TO 4-11",11,"X TO 4","DANDI FIRMANSYAH",18190546,"0038168659"]
[536,"X TO 4-12",12,"X TO 4","DIANA AGUSTIN",18190547,"0025182291"]
[537,"X TO 4-13",13,"X TO 4","DICKY FIRMANSYAH",18190548,"0038949210"]
[538,"X TO 4-14",14,"X TO 4","DICKY MAULANA",18190549,"0039998117"]
[539,"X TO 4-15",15,"X TO 4","ERI RAHMA",18190550,"0036297290"]
[540,"X TO 4-16",16,"X TO 4","FADILAH SALEH",18190551,"0034681397"]
[541,"X TO 4-17",17,"X TO 4","FERIS ANDRIAN CHANDRA",18190552,"0036749736"]
[542,"X TO 4-18",18,"X TO 4","GERALD MARCOS",18190553,"0024044247"]
[543,"X TO 4-19",19,"X TO 4","GILANG PERMANA",18190554,"0037829516"]
[544,"X TO 4-20",20,"X TO 4","GILANG TEJA SUKMANA",18190555,"0026126832"]
[545,"X TO 4-21",21,"X TO 4","HANSYAH AINURROUF",18190556,"0039692553"]
[546,"X TO 4-22",22,"X TO 4","IKSBAL MAULANA AKSAN",18190557,"0021145998"]
[547,"X TO 4-23",23,"X TO 4","KRISNAWAN",18190558,"0026016162"]
[548,"X TO 4-24",24,"X TO 4","MOCH. DANDI",18190559,"0038175929"]
[549,"X TO 4-25",25,"X TO 4","MOCHAMAD RIFAL NURFAZRI",18190560,"0038671182"]
[550,"X TO 4-26",26,"X TO 4","NOVAN GHAISAN AZHAR",18190561,"0022629707"]
[551,"X TO 4-27",27,"X TO 4","RAKA DWI MAULANA",18190562,"0026106132"]
[552,"X TO 4-28",28,"X TO 4","RANDI JANUAR PRIBADI",18190563,"0048591139"]
[553,"X TO 4-29",29,"X TO 4","RIVA PANDUDINATA",18190564,"0032253232"]
[554,"X TO 4-30",30,"X TO 4","RIZKY MAULANA",18190565,"0032491436"]
[555,"X TO 4-31",31,"X TO 4","RUDIANSYAH",18190566,"0038675124"]
[556,"X TO 4-32",32,"X TO 4","SONY  MARCELLINO",18190567,"0035299417"]
[557,"X TO 4-33",33,"X TO 4","TAUFIK SATRIA HIDAYATULLOH",18190568,"0038459004"]
[558,"X TO 4-34",34,"X TO 4","UCU ARNI",18190569,"0015082126"]
[559,"X TO 4-35",35,"X TO 4","WATI OKTAVIA",18190570,"0036809572"]
[560,"X TO 4-36",36,"X TO 4","WENDI ERLANGGA BAYU SUGARA",18190571,"0037946394"]
[561,"X TE 1-1",1,"X TE 1","ADJI ABDUL MADJID",18190572,"0030497743"]
[562,"X TE 1-2",2,"X TE 1","AHMAD MUBARROK ANWAR",18190573,"0034779857"]
[563,"X TE 1-3",3,"X TE 1","AHMAD MULYANA",18190574,"0034601039"]
[564,"X TE 1-4",4,"X TE 1","ASEP SUKARYA",18190575,"0027149799"]
[565,"X TE 1-5",5,"X TE 1","ASIH NABELA",18190576,"0026735036"]
[566,"X TE 1-6",6,"X TE 1","AYUB HADI WIJAYA",18190577,"0031704638"]
[567,"X TE 1-7",7,"X TE 1","DELIA PUTRI",18190578,"0029124437"]
[568,"X TE 1-8",8,"X TE 1","FADLY AL GHIFARY",18190579,"0031134013"]
[569,"X TE 1-9",9,"X TE 1","FEDERICHO ZAUNDRI HERLAMBANG",18190580,"0037858258"]
[570,"X TE 1-10",10,"X TE 1","HANA MARLIA WILU UTAMI",18190581,"0037846378"]
[571,"X TE 1-11",11,"X TE 1","IRFAN NURAZIIZ RIZQULLOH",18190582,"0038251861"]
[572,"X TE 1-12",12,"X TE 1","JASMINE DINA SABILA",18190583,"0031114691"]
[573,"X TE 1-13",13,"X TE 1","MIQDAD MUDHOFAR",18190584,"0032516739"]
[574,"X TE 1-14",14,"X TE 1","MUHAMAD HAMDANI",18190585,"0039921255"]
[575,"X TE 1-15",15,"X TE 1","MUHAMMAD ALIF RAMADHAN",18190586,"0039621507"]
[576,"X TE 1-16",16,"X TE 1","MUHAMMAD FARHAN",18190587,"0039637025"]
[577,"X TE 1-17",17,"X TE 1","MUHAMMAD JAFAR FUADI",18190588,"0036990526"]
[578,"X TE 1-18",18,"X TE 1","MUHAMMAD RAMA MAULANA",18190589,"0032102688"]
[{"$f":"A580+1","v":579},{"$f":"D581&\"-\"&C581","v":"X TE 1-19"},{"$f":"IF(D580=D581,C580+1,1)","v":19},"X TE 1","MUHAMMAD RIZKI ZAIDAN C",18190590,"0038678464"]
[580,"X TE 1-20",20,"X TE 1","MUHAMMAD YOGI NUGROHO",18190591,"0038052709"]
[581,"X TE 1-21",21,"X TE 1","NAUFAL ADIYAAT NUZUL DHUHAA",18190592,"0036268196"]
[582,"X TE 1-22",22,"X TE 1","NURUL ANISA",18190593,"0036177965"]
[583,"X TE 1-23",23,"X TE 1","OKKY NUR OKTA VIANY",18190594,"0028665135"]
[584,"X TE 1-24",24,"X TE 1","RAHMAT YUDI PURNAMA",18190595,"0026348936"]
[585,"X TE 1-25",25,"X TE 1","RIKI AWAL SYAHPUTRA",18190596,"0030145463"]
[586,"X TE 1-26",26,"X TE 1","SAEFUL NURROHMAN",18190597,"0034528346"]
[587,"X TE 1-27",27,"X TE 1","SARAH FITRI NURPAZRIAH",18190598,"0029603428"]
[588,"X TE 1-28",28,"X TE 1","SEPTIAN RABBANI",18190599,"0032615633"]
[589,"X TE 1-29",29,"X TE 1","SHAFA KHUSNUL KHOTIMAH",18190600,"0041441548"]
[590,"X TE 1-30",30,"X TE 1","SILA LISTIANA",18190601,"0032516721"]
[591,"X TE 1-31",31,"X TE 1","SITI AISYAH",18190602,"0026508596"]
[592,"X TE 1-32",32,"X TE 1","SITI KHODIJAH RADAHWIA",18190603,"0039977679"]
[593,"X TE 1-33",33,"X TE 1","SITI NURFADILAH",18190604,"0037540921"]
[594,"X TE 1-34",34,"X TE 1","SRI RAHAYU",18190605,"0038733471"]
[595,"X TE 1-35",35,"X TE 1","YANA FIMANSYAH",18190606,"0038335081"]
[596,"X TE 1-36",36,"X TE 1","YUDHA MAHUREKSA",18190607,"0024435009"]
[597,"X TE 2-1",1,"X TE 2","AFIFA CIKA PUTRI",18190608,"0037390988"]
[598,"X TE 2-2",2,"X TE 2","AINUN SHOLIHAH",18190609,"0039807083"]
[599,"X TE 2-3",3,"X TE 2","ALIF HIDAYAH RASHAL",18190610,"0034744163"]
[600,"X TE 2-4",4,"X TE 2","ANNE SINTIYA",18190611,"0038755440"]
[601,"X TE 2-5",5,"X TE 2","DEDE RAMA ADITYA",18190612,"0039260235"]
[602,"X TE 2-6",6,"X TE 2","DEDEH KURNIASIH",18190613,"0027806140"]
[603,"X TE 2-7",7,"X TE 2","DELA PUSPITA",18190614,"0064710874"]
[604,"X TE 2-8",8,"X TE 2","ENDRI",18190615,"0028931079"]
[605,"X TE 2-9",9,"X TE 2","HALIF MAULIANA",18190616,"0036217217"]
[606,"X TE 2-10",10,"X TE 2","HIKMAL HIFNY GHIFARI",18190617,"0034779778"]
[607,"X TE 2-11",11,"X TE 2","IJLAL LABIB SHALIHA FIZIK",18190618,"0034744203"]
[608,"X TE 2-12",12,"X TE 2","IKHSANUDIN MAHDI",18190619,"0027368395"]
[609,"X TE 2-13",13,"X TE 2","IMEL AMELIA",18190620,"0024245588"]
[610,"X TE 2-14",14,"X TE 2","JUARSIH MAULIDIA",18190621,"0039570469"]
[611,"X TE 2-15",15,"X TE 2","MARLANUDIN",18190622,"0011483216"]
[612,"X TE 2-16",16,"X TE 2","MOHAMAD ARI DARMAWAN",18190623,"0028485361"]
[613,"X TE 2-17",17,"X TE 2","MUHAMMAD  DZIKRI RAMADHANI",18190624,"0038459041"]
[614,"X TE 2-18",18,"X TE 2","NANDA SAPUTRA",18190625,"0027169452"]
[615,"X TE 2-19",19,"X TE 2","NAUFAL ZIDAN AL' FARUQI",18190626,"0034522280"]
[616,"X TE 2-20",20,"X TE 2","NICCO INDRA SAPUTRA",18190627,"0033297099"]
[617,"X TE 2-21",21,"X TE 2","NUR HABIBAH",18190628,"0033320885"]
[618,"X TE 2-22",22,"X TE 2","PUTRI MULYANI",18190629,"0038327480"]
[619,"X TE 2-23",23,"X TE 2","PUTRI NURAZIZAH",18190630,"0035089150"]
[620,"X TE 2-24",24,"X TE 2","RENDI JAHURI",18190631,"0025882294"]
[621,"X TE 2-25",25,"X TE 2","RIDLWANA PADLILAH",18190632,"0035079725"]
[622,"X TE 2-26",26,"X TE 2","RIO HERMANSYAH",18190633,"0035078813"]
[623,"X TE 2-27",27,"X TE 2","SANDRA RIZKYA PRADINA",18190634,"0033429658"]
[624,"X TE 2-28",28,"X TE 2","SANIRA ZAHRA MAULANI",18190635,"0034811356"]
[625,"X TE 2-29",29,"X TE 2","SOFIYANTI",18190636,"0025709598"]
[626,"X TE 2-30",30,"X TE 2","SUSANTI RAHMAWATI PUTRI",18190637,"0077052783"]
[627,"X TE 2-31",31,"X TE 2","SUSINTA RAHMAWATI PUTRI",18190638,"0031125418"]
[628,"X TE 2-32",32,"X TE 2","TYA RACHMADANTI",18190639,"0021463978"]
[629,"X TE 2-33",33,"X TE 2","VINA APRIANTI",18190640,"0038547803"]
[630,"X TE 2-34",34,"X TE 2","WILDAN RIZKY MAULANA",18190641,"0026254853"]
[631,"X TE 2-35",35,"X TE 2","WINDI APRIONITA",18190642,"0037063880"]
[632,"X TE 2-36",36,"X TE 2","WINDI FEBRIYANTI",18190643,"0033315637"]
[633,"X TE 3-1",1,"X TE 3","AA ALDYANSYAH",18190644,"0029605254"]
[634,"X TE 3-2",2,"X TE 3","ABDUL AZIZ",18190645,"0038672028"]
[635,"X TE 3-3",3,"X TE 3","AHMAD FUAD HASIM",18190646,"0024341526"]
[636,"X TE 3-4",4,"X TE 3","AJENG RISKA DYAH UTAMI",18190647,"0033297531"]
[637,"X TE 3-5",5,"X TE 3","ALFIAN YULIANTO",18190648,"0029101726"]
[638,"X TE 3-6",6,"X TE 3","ANDINA PUSPITA RANI",18190649,"0035678863"]
[639,"X TE 3-7",7,"X TE 3","ANNISA MARWA",18190650,"0031881332"]
[640,"X TE 3-8",8,"X TE 3","ARTIKA DEWI YANI",18190651,"0045004693"]
[641,"X TE 3-9",9,"X TE 3","AZIS MUHAMAD ALWI",18190652,"0038052710"]
[642,"X TE 3-10",10,"X TE 3","CAHYADI",18190653,"0037390986"]
[{"$f":"A644+1","v":643},{"$f":"D645&\"-\"&C645","v":"X TE 3-11"},{"$f":"IF(D644=D645,C644+1,1)","v":11},"X TE 3","DEVITA IRMA",18190654,"0036004739"]
[644,"X TE 3-12",12,"X TE 3","EKA STEVANI KALAKE",18190655,"0033297550"]
[645,"X TE 3-13",13,"X TE 3","ENDAHNA WULAN PERMATASARI",18190656,"0034689897"]
[646,"X TE 3-14",14,"X TE 3","FIKRAL AHMA RAMADHAN",18190657,"0039879700"]
[647,"X TE 3-15",15,"X TE 3","FIRMANSAH",18190658,"0022667581"]
[648,"X TE 3-16",16,"X TE 3","FITRI LESTARI WIJAYA",18190659,"0021327228"]
[649,"X TE 3-17",17,"X TE 3","IHSANUDIN ALBANI",18190660,"0033297271"]
[650,"X TE 3-18",18,"X TE 3","ILHAM MUBAROK",18190661,"0033170926"]
[651,"X TE 3-19",19,"X TE 3","IRSHA MAULIDINA ATTE",18190662,"0035895168"]
[652,"X TE 3-20",20,"X TE 3","KARINA SEPTIANI",18190663,"0039187343"]
[653,"X TE 3-21",21,"X TE 3","KEVIN NAUFAL BACHTIAR",18190664,"0033213276"]
[654,"X TE 3-22",22,"X TE 3","LAKSMANA YUDHA PRATAMA ALSTARE",18190665,"0038686727"]
[655,"X TE 3-23",23,"X TE 3","LUTHFI AJAMI",18190666,"0030065589"]
[656,"X TE 3-24",24,"X TE 3","MARLYN DIVA CHRISTINA",18190667,"0034779794"]
[657,"X TE 3-25",25,"X TE 3","MAYA ASRIAH",18190668,"0032269973"]
[658,"X TE 3-26",26,"X TE 3","MAYSUN PRIHATI NINGSIH",18190669,"0044523106"]
[659,"X TE 3-27",27,"X TE 3","MEILLANI  PUSPA NINGTIYAS",18190670,"0035895181"]
[660,"X TE 3-28",28,"X TE 3","MUHAMMAD FAHRI HUSAINI",18190671,"0033361460"]
[661,"X TE 3-29",29,"X TE 3","NURHAOLIANAH",18190672,"0037528207"]
[662,"X TE 3-30",30,"X TE 3","NURUL MARISA",18190673,"0034756211"]
[663,"X TE 3-31",31,"X TE 3","SAKILAH YULIYANTI",18190674,"0032225735"]
[664,"X TE 3-32",32,"X TE 3","SETIAWAN AJI NUGROHO",18190675,"0035079658"]
[665,"X TE 3-33",33,"X TE 3","SITI NUR FADLILLAH UMMAH",18190676,"0045708093"]
[666,"X TE 3-34",34,"X TE 3","SRI HARTATI",18190677,"0034246174"]
[667,"X TE 3-35",35,"X TE 3","SYLVIA ROSTIANI",18190678,"0029874384"]
[668,"X TE 3-36",36,"X TE 3","WITRI WULANDARI",18190679,"0036889250"]
[669,"X TKI 1-1",1,"X TKI 1","ADILLAH KUSUMA WIJAYA",18190680,"0036022805"]
[670,"X TKI 1-2",2,"X TKI 1","AMIR MAHMUD",18190681,"0040313517"]
[671,"X TKI 1-3",3,"X TKI 1","ANDINI JORLAEND NENDER",18190682,"0035157103"]
[672,"X TKI 1-4",4,"X TKI 1","AZIS MAULANA",18190683,"0037391011"]
[673,"X TKI 1-5",5,"X TKI 1","AZRIEL AZHAR AZURI",18190684,"0028139403"]
[674,"X TKI 1-6",6,"X TKI 1","CAHYA FADILA OKTAVIA",18190685,"0037608710"]
[675,"X TKI 1-7",7,"X TKI 1","DIAS SALZA BILLA",18190686,"0032615644"]
[676,"X TKI 1-8",8,"X TKI 1","FAQIH HADI MANSURY",18190687,"0032491100"]
[677,"X TKI 1-9",9,"X TKI 1","FAYZA AMALIA PUTRI",18190688,"0024763635"]
[678,"X TKI 1-10",10,"X TKI 1","FITRIANI SIDIK LESTARI",18190689,"0039043072"]
[679,"X TKI 1-11",11,"X TKI 1","HAIKAL FASIHA FAYYADH",18190690,"0038008326"]
[680,"X TKI 1-12",12,"X TKI 1","LUTFIA FAUZI",18190691,"0049635476"]
[681,"X TKI 1-13",13,"X TKI 1","MARINI ARLIANI SALAMPESSY",18190692,"0038807653"]
[682,"X TKI 1-14",14,"X TKI 1","MAULA HANIF IBRAHIM",18190693,"0035222750"]
[683,"X TKI 1-15",15,"X TKI 1","MAYA KURNIASARI",18190694,"0038681826"]
[684,"X TKI 1-16",16,"X TKI 1","MICHEL RICWEN PARDEDE",18190695,"0039295231"]
[685,"X TKI 1-17",17,"X TKI 1","MILA PUJIATIN IRINA",18190696,"0034573812"]
[686,"X TKI 1-18",18,"X TKI 1","MUHAMAD NURHIKMAT MAULIDIN",18190697,"0034659204"]
[687,"X TKI 1-19",19,"X TKI 1","NURAZMI DHIMAS AZIZAH",18190698,"0033805205"]
[688,"X TKI 1-20",20,"X TKI 1","NURLAELI",18190699,"0037179771"]
[689,"X TKI 1-21",21,"X TKI 1","NURUL FADILLAH",18190700,"0037403541"]
[690,"X TKI 1-22",22,"X TKI 1","OKTAVIA RAHMADANI",18190701,"0033244362"]
[691,"X TKI 1-23",23,"X TKI 1","PUTRI NUR AZIZAH",18190702,"0023707649"]
[692,"X TKI 1-24",24,"X TKI 1","RASTA SIFA IBNU FADILLAH",18190703,"0036595992"]
[693,"X TKI 1-25",25,"X TKI 1","RIANTI AGUSTIN",18190704,"0037154449"]
[694,"X TKI 1-26",26,"X TKI 1","RIKA PURNAMA",18190705,"0032108693"]
[695,"X TKI 1-27",27,"X TKI 1","RISKA SRI RAHAYU",18190706,"0039232259"]
[696,"X TKI 1-28",28,"X TKI 1","SALMA ZHAFARINA",18190708,"0034673726"]
[697,"X TKI 1-29",29,"X TKI 1","SARAH AZZAHRA",18190709,"0026612780"]
[698,"X TKI 1-30",30,"X TKI 1","SARAH MEGA ARUM",18190710,"0032483175"]
[699,"X TKI 1-31",31,"X TKI 1","SEVRIDA CHANDRA DEWI",18190711,"0038622085"]
[700,"X TKI 1-32",32,"X TKI 1","SITI NURJAMILAH",18190712,"0020187150"]
[701,"X TKI 1-33",33,"X TKI 1","SUKMA WANGSA DINATA",18190713,"0039387093"]
[702,"X TKI 1-34",34,"X TKI 1","YENI YULIANTI",18190714,"0032615660"]
[703,"X TKI 1-35",35,"X TKI 1","ZAENAL ALFIAN",18190715,"0034835137"]
[704,"X TKI 2-1",1,"X TKI 2","AFIFAH SILMI APANDI",18190716,"0026653413"]
[705,"X TKI 2-2",2,"X TKI 2","AMALIA KARTIKA",18190717,"0039823406"]
[706,"X TKI 2-3",3,"X TKI 2","ARINI DINANTI",18190718,"0037574598"]
[{"$f":"A708+1","v":707},{"$f":"D709&\"-\"&C709","v":"X TKI 2-4"},{"$f":"IF(D708=D709,C708+1,1)","v":4},"X TKI 2","CANDI PRADIPTA ABISEKA",18190719,"0033675024"]
[708,"X TKI 2-5",5,"X TKI 2","CHAERUL ANWAR NASUTION",18190720,"0039493133"]
[709,"X TKI 2-6",6,"X TKI 2","DANA MULYANA",18190721,"0025785471"]
[710,"X TKI 2-7",7,"X TKI 2","FAUZHAN RAMADHAN",18190722,"0028139417"]
[711,"X TKI 2-8",8,"X TKI 2","HIKMAH ALLAYDA AWALI SOLIHIN",18190723,"0036400963"]
[712,"X TKI 2-9",9,"X TKI 2","KAZHIMAH SALSABILA KATENI PUTRI",18190724,"0031657089"]
[713,"X TKI 2-10",10,"X TKI 2","KHANSA GALIH SEPTAHADI",18190725,"0036918500"]
[714,"X TKI 2-11",11,"X TKI 2","MEGA PEBRIYANIE",18190726,"0039442110"]
[715,"X TKI 2-12",12,"X TKI 2","MUHAMAD NUSANTARA GUNTUR",18190727,"0033962486"]
[716,"X TKI 2-13",13,"X TKI 2","MUHAMMAD AUFA TSAQIB BALEBAT DASIM",18190728,"0035429138"]
[717,"X TKI 2-14",14,"X TKI 2","MUHAMMAD FAKHRI DARISE",18190729,"0028174257"]
[718,"X TKI 2-15",15,"X TKI 2","MUHAMMAD FARHAN",18190730,"0021948670"]
[719,"X TKI 2-16",16,"X TKI 2","NADIA RIZKA SALSABILA",18190731,"0032464331"]
[720,"X TKI 2-17",17,"X TKI 2","NURHAYATI",18190732,"0035962748"]
[721,"X TKI 2-18",18,"X TKI 2","PUJA PUTRI INTAN PRAMUDHA",18190733,"0024214769"]
[722,"X TKI 2-19",19,"X TKI 2","PUTRI HAWALIA",18190734,"0031528711"]
[723,"X TKI 2-20",20,"X TKI 2","RAHMA AINUNNISA",18190735,"0034298436"]
[724,"X TKI 2-21",21,"X TKI 2","RAODATUL  ROHMAH",18190736,"0029626311"]
[725,"X TKI 2-22",22,"X TKI 2","RATNA MULYANI MUTMAINAH",18190737,"          "]
[726,"X TKI 2-23",23,"X TKI 2","RAYMOND MIKHA ANDRIAN",18190738,"0024623612"]
[727,"X TKI 2-24",24,"X TKI 2","REZA SHAHAB",18190739,"0032491459"]
[728,"X TKI 2-25",25,"X TKI 2","RIAN SURYANA",18190740,"0031657078"]
[729,"X TKI 2-26",26,"X TKI 2","RINA ANGGRAENI",18190741,"0035325884"]
[730,"X TKI 2-27",27,"X TKI 2","RINI ANGGRAENI",18190742,"0026508551"]
[731,"X TKI 2-28",28,"X TKI 2","SAKA GALANG PERSADA",18190743,"0035316783"]
[732,"X TKI 2-29",29,"X TKI 2","SHINTYA MAULIENA",18190744,"0040334596"]
[733,"X TKI 2-30",30,"X TKI 2","SITI LUTHFIAH ALFIATUNISA",18190745,"0038671153"]
[734,"X TKI 2-31",31,"X TKI 2","SITI ROSADAH",18190746,"0025514593"]
[735,"X TKI 2-32",32,"X TKI 2","TATI MULYATI",18190747,"0036772961"]
[736,"X TKI 2-33",33,"X TKI 2","YANTI",18190748,"0035157110"]
[737,"X TKI 2-34",34,"X TKI 2","ZIAD ABDUL ISA",18190749,"0024042515"]
[738,"X TKI 2-35",35,"X TKI 2","ZIDANE RAHMAT HANDOKO",18190750,"0025758218"]
[739,"X TKI 2-36",36,"X TKI 2","FATIH RIZKI SANTOSO",18190859,"0036217242"]
[740,"X TKI 3-1",1,"X TKI 3","AAN SRINITA",18190751,"0039253808"]
[741,"X TKI 3-2",2,"X TKI 3","ADITYA FAHRIANSYAH",18190752,"0022080920"]
[742,"X TKI 3-3",3,"X TKI 3","ADITYA SUBANGKIT",18190753,"0028932529"]
[743,"X TKI 3-4",4,"X TKI 3","ANI FITRIYANI",18190754,"0036360878"]
[744,"X TKI 3-5",5,"X TKI 3","APRILLIANTI WULAN SARI",18190755,"0034328318"]
[745,"X TKI 3-6",6,"X TKI 3","ARBY SURYA TRI ATMAJA",18190756,"0036920309"]
[746,"X TKI 3-7",7,"X TKI 3","ASRI RAHAYU",18190757,"0036899303"]
[747,"X TKI 3-8",8,"X TKI 3","BAWANA BAYU SUGIHARTO",18190758,"0039943137"]
[748,"X TKI 3-9",9,"X TKI 3","BELLA BERLIANA",18190759,"0028741438"]
[749,"X TKI 3-10",10,"X TKI 3","DEWI OKTAVIANA HAPSARI",18190760,"0034753954"]
[750,"X TKI 3-11",11,"X TKI 3","DICKY THOPAL FUDOLY",18190761,"0032833516"]
[751,"X TKI 3-12",12,"X TKI 3","DINDA RAHMA AULIA",18190762,"0038459022"]
[752,"X TKI 3-13",13,"X TKI 3","DWI MAULIDYA",18190763,"0032491083"]
[753,"X TKI 3-14",14,"X TKI 3","ILHAM MANSIS JATNIKA",18190764,"0037716858"]
[754,"X TKI 3-15",15,"X TKI 3","INTANA",18190765,"0039256318"]
[755,"X TKI 3-16",16,"X TKI 3","KEISYA ZAHRA CAMILA",18190766,"0034598628"]
[756,"X TKI 3-17",17,"X TKI 3","LALA NURYANI",18190767,"0029427474"]
[757,"X TKI 3-18",18,"X TKI 3","MUHAMMAD YAHYA AYYASH",18190768,"0033213289"]
[758,"X TKI 3-19",19,"X TKI 3","NADIA NUR ANISA",18190769,"0034088684"]
[759,"X TKI 3-20",20,"X TKI 3","NURMALA AYU",18190770,"0029368368"]
[760,"X TKI 3-21",21,"X TKI 3","PITRI GESTIA LISTARI",18190771,"0037977472"]
[761,"X TKI 3-22",22,"X TKI 3","PUTRI SEKAR WIDARYANTI",18190772,"0032833557"]
[762,"X TKI 3-23",23,"X TKI 3","SABILLA NURUL PRATIWI",18190773,"0039607393"]
[763,"X TKI 3-24",24,"X TKI 3","SELVIANA PUTRI NABILAH",18190774,"0032606496"]
[764,"X TKI 3-25",25,"X TKI 3","SITI ABROORIYYAH KOSIM",18190775,"0033985116"]
[765,"X TKI 3-26",26,"X TKI 3","SITI FATIMAH  (A)",18190776,"0032833890"]
[766,"X TKI 3-27",27,"X TKI 3","SITI FATIMAH  (B)",18190777,"0032721971"]
[767,"X TKI 3-28",28,"X TKI 3","TAMARA SARI IRAWAN",18190778,"0030591308"]
[768,"X TKI 3-29",29,"X TKI 3","TEGAS MAULANA DZAKIY",18190779,"0037668398"]
[769,"X TKI 3-30",30,"X TKI 3","TIA ARA LESTARI",18190780,"0020920616"]
[770,"X TKI 3-31",31,"X TKI 3","WAHYU RAHMAT HIDAYAT",18190781,"0020924224"]
[{"$f":"A772+1","v":771},{"$f":"D773&\"-\"&C773","v":"X TKI 3-32"},{"$f":"IF(D772=D773,C772+1,1)","v":32},"X TKI 3","YOLANDA",18190782,"0037488253"]
[772,"X TKI 3-33",33,"X TKI 3","YUFIZTO BINTANG MAHA PUTRA",18190783,"0035316789"]
[773,"X TKI 3-34",34,"X TKI 3","YULIA PUSPITA",18190784,"0039153392"]
[774,"X TKI 3-35",35,"X TKI 3","YULIANA",18190785,"0020920626"]
[775,"X TKI 3-36",36,"X TKI 3","ZHALILAH RHEA REZKY NURBIKAH",18190786,"0046540561"]
[776,"X TKI 4-1",1,"X TKI 4","ABDULLAH ALGHIFARI",18190787,"0026320017"]
[777,"X TKI 4-2",2,"X TKI 4","AGUNG SETYA PURNAMA",18190788,"0032798923"]
[778,"X TKI 4-3",3,"X TKI 4","AGUS FERIAWAN",18190789,"0039964337"]
[779,"X TKI 4-4",4,"X TKI 4","AI LIPALDO",18190790,"0038691594"]
[780,"X TKI 4-5",5,"X TKI 4","AISYAH ANDINI PUTRIKUSNADI",18190791,"0033449430"]
[781,"X TKI 4-6",6,"X TKI 4","ANDINI APRIYATIN",18190792,"0038804106"]
[782,"X TKI 4-7",7,"X TKI 4","ARYA BUDIMAN",18190793,"0032648436"]
[783,"X TKI 4-8",8,"X TKI 4","ASDELLA TIARA PUTRI",18190794,"0027066511"]
[784,"X TKI 4-9",9,"X TKI 4","ATHENA SAHADATUNNISA",18190795,"0030865840"]
[785,"X TKI 4-10",10,"X TKI 4","DEDE MARTIYANI",18190796,"0026642289"]
[786,"X TKI 4-11",11,"X TKI 4","DHANI RIZIK AMRI",18190797,"0031820411"]
[787,"X TKI 4-12",12,"X TKI 4","DIMAS LYSTIANTO",18190799,"0037533907"]
[788,"X TKI 4-13",13,"X TKI 4","DONNI AGUSTIAN BINTANG P",18190800,"0039961644"]
[789,"X TKI 4-14",14,"X TKI 4","FAHAD ABDILLAH",18190801,"0036697114"]
[790,"X TKI 4-15",15,"X TKI 4","IIS SEPTIYANI",18190802,"0028635626"]
[791,"X TKI 4-16",16,"X TKI 4","IRA RAHMAWATI",18190803,"0034518532"]
[792,"X TKI 4-17",17,"X TKI 4","LILIS NOER KHOLISOH",18190804,"0030497734"]
[793,"X TKI 4-18",18,"X TKI 4","MARIA AFRILIANA",18190805,"0034779817"]
[794,"X TKI 4-19",19,"X TKI 4","MAYSAHNUR HARAHAP",18190806,"0037942024"]
[795,"X TKI 4-20",20,"X TKI 4","MIKHAEL WIJAYA",18190807,"0034710193"]
[796,"X TKI 4-21",21,"X TKI 4","MOHAMMAD SAYID AL HUSEN",18190808,"0038611775"]
[797,"X TKI 4-22",22,"X TKI 4","MUHAMAD PARHAN GIMNASTIAR",18190809,"0027695109"]
[798,"X TKI 4-23",23,"X TKI 4","NADILA",18190810,"0037563732"]
[799,"X TKI 4-24",24,"X TKI 4","NADYA OCTAVIA",18190811,"0032280255"]
[800,"X TKI 4-25",25,"X TKI 4","NIMAS AGUSTIN",18190812,"0033170677"]
[801,"X TKI 4-26",26,"X TKI 4","PRADINA HIDAYAT",18190813,"0032385550"]
[802,"X TKI 4-27",27,"X TKI 4","RIRI RIANI KARNIA",18190814,"0033107822"]
[803,"X TKI 4-28",28,"X TKI 4","RIZKI HERMAWAN",18190815,"0039479842"]
[804,"X TKI 4-29",29,"X TKI 4","SANTI JUNIARTI",18190816,"0031971583"]
[805,"X TKI 4-30",30,"X TKI 4","TEGUH GUNTORO",18190817,"0032516770"]
[806,"X TKI 4-31",31,"X TKI 4","TRI MULYANI",18190818,"0015489429"]
[807,"X TKI 4-32",32,"X TKI 4","VIRA HERNANDA SARI",18190819,"0033276535"]
[808,"X TKI 4-33",33,"X TKI 4","WIDAYANTI",18190820,"0036476901"]
[809,"X TKI 4-34",34,"X TKI 4","WISNU MAHARDIKA",18190821,"0033396754"]
[810,"X TKI 4-35",35,"X TKI 4","YANAH",18190822,"0039799848"]
[811,"X TKI 5-1",1,"X TKI 5","ACHMAD HABBYBY MUSTAFA",18190823,"0027092633"]
[812,"X TKI 5-2",2,"X TKI 5","ALLIZA WULANDARI",18190824,"0032842084"]
[813,"X TKI 5-3",3,"X TKI 5","AMIRAH FITRI TAQIE",18190825,"0029082283"]
[814,"X TKI 5-4",4,"X TKI 5","ANGGUN ESRA MANALU",18190826,"0047801515"]
[815,"X TKI 5-5",5,"X TKI 5","CHEVIN NURDIYAT",18190827,"0034700573"]
[816,"X TKI 5-6",6,"X TKI 5","CHRISTINUS ERWINDO ERWANSYA",18190828,"0035768131"]
[817,"X TKI 5-7",7,"X TKI 5","DADAN SUPIANA HIDAYAT",18190829,"0028614566"]
[818,"X TKI 5-8",8,"X TKI 5","DENADA PUSPITA",18190830,"0039471456"]
[819,"X TKI 5-9",9,"X TKI 5","DIMAS SYAH DINATA",18190831,"0035362996"]
[820,"X TKI 5-10",10,"X TKI 5","EKA SEPTIANI SHAPUTRA",18190832,"0034335259"]
[821,"X TKI 5-11",11,"X TKI 5","ERY HERDIANSYAH",18190833,"0020269448"]
[822,"X TKI 5-12",12,"X TKI 5","GHANI ABASSYAH HELAR",18190834,"0026575701"]
[823,"X TKI 5-13",13,"X TKI 5","GILANG PANGESTU",18190835,"0028848854"]
[824,"X TKI 5-14",14,"X TKI 5","GUGUN GUNAWAN",18190836,"0029827586"]
[825,"X TKI 5-15",15,"X TKI 5","HANIFAH NUURUL QIBTIYAH",18190837,"0032729597"]
[826,"X TKI 5-16",16,"X TKI 5","MEILINA NURFADILA",18190838,"0032833703"]
[827,"X TKI 5-17",17,"X TKI 5","MUHAMAD RIZKI RAMADHAN",18190839,"0027587041"]
[828,"X TKI 5-18",18,"X TKI 5","MUHAMMAD ARIF WILDAN",18190840,"0031794968"]
[829,"X TKI 5-19",19,"X TKI 5","MUHAMMAD HAVIS DWI SEPTIO",18190841,"0024769571"]
[830,"X TKI 5-20",20,"X TKI 5","MUHRIZAL MATHOFANY",18190842,"0036850835"]
[831,"X TKI 5-21",21,"X TKI 5","RACKA PANDU KUSUMAH",18190843,"0032798519"]
[832,"X TKI 5-22",22,"X TKI 5","RAHA NUGRAHA",18190844,"0040171450"]
[833,"X TKI 5-23",23,"X TKI 5","RAHMAWATI",18190845,"0026770219"]
[834,"X TKI 5-24",24,"X TKI 5","RESTU MUHAMMAD RIZKI",18190846,"0033771830"]
[{"$f":"A836+1","v":835},{"$f":"D837&\"-\"&C837","v":"X TKI 5-25"},{"$f":"IF(D836=D837,C836+1,1)","v":25},"X TKI 5","RIHANA MARSHANDA PUTRI",18190847,"0031228489"]
[836,"X TKI 5-26",26,"X TKI 5","RIKI PURNOMO",18190848,"0033868640"]
[837,"X TKI 5-27",27,"X TKI 5","RIKKY KHARISMA TAMBUNAN",18190849,"0032798346"]
[838,"X TKI 5-28",28,"X TKI 5","SALSA MAULIDHYA",18190850,"0026074363"]
[839,"X TKI 5-29",29,"X TKI 5","SITI MARFUAH",18190851,"0037919576"]
[840,"X TKI 5-30",30,"X TKI 5","SRI MAHARANI",18190852,"0028174241"]
[841,"X TKI 5-31",31,"X TKI 5","SYAHRUL RAMDANI",18190853,"0023456789"]
[842,"X TKI 5-32",32,"X TKI 5","VIA SUCIYANA",18190854,"0028931090"]
[843,"X TKI 5-33",33,"X TKI 5","WIDYA ANGGRAINI PRATIWI",18190855,"0038710953"]
[844,"X TKI 5-34",34,"X TKI 5","YEPI ABDUL KARIM",18190856,"0036845815"]
[845,"X TKI 5-35",35,"X TKI 5","YOGI PERMANA PUTRA",18190857,"0035801153"]
[846,"X TKI 5-36",36,"X TKI 5","YUNITA",18190858,"0036643160"]

{"sheet":"KHB","index":3,"n_rows":45,"n_cols":14,"rows_kept":45,"cut":false,"hidden":false,"merged":[[7,12,7,13],[12,12,12,13],[13,12,14,12],[13,13,14,13],[8,12,10,12],[8,13,10,13],[21,12,21,13],[9,2,9,7],[10,2,10,7],[15,12,16,12],[15,13,16,13],[26,3,26,7],[27,3,27,7],[28,3,28,7],[11,1,11,7],[12,1,12,7],[13,1,13,7],[16,4,16,6],[17,4,17,6],[21,3,21,4],[22,3,22,4],[23,3,23,4],[18,4,18,5],[7,1,7,7],[8,1,8,7],[1,1,1,7],[2,1,2,7],[3,1,3,7],[4,1,4,7],[5,1,5,7],[6,1,6,7]]}
[]
[null,"PEMERINTAH DAERAH PROVINSI JAWA BARAT"]
[null,"DINAS PENDIDIKAN"]
[null,"CABANG DINAS PENDIDIKAN WILAYAH IV"]
[null,"SEKOLAH MENENGAH KEJURUAN NEGERI 1 KARAWANG"]
[null,"Jalan Pangkal Perjuangan By Pass Telp. 0267-401651"]
[null,"Website: www.smkn1karawang.sch.id"]
[null,"Email : smkn1karawang@gmail.com",null,null,null,null,null,null,null,null,null,null,"TAMPILAN DATA"]
[null,"Karawang - 41316",null,null,null,null,null,null,null,null,null,null,"Nomor Urut",35]
[]
[]
[null,"KARTU HASIL BELAJAR"]
[null,"TAHUN PELAJARAN 2018/2019",null,null,null,null,null,null,null,null,null,null,"HALAMAN CETAK"]
[null,"MATA PELAJARAN PENDIDIKAN LINGKUNGAN HIDUP",null,null,null,null,null,null,null,null,null,null,"Dari data ke",2]
[]
[null,null,null,null,null,null,null,null,null,null,null,null,"Sampai data ke",2]
[null,"Nama Peserta Didik",null,":",{"$f":"VLOOKUP($N$9,DATA_NILAI,DATA!E2)","v":"ABDUL MAJID ALHISNA"}]
[null,"Nomor Induk/NISN",null,":",{"$f":"VLOOKUP($N$9,DATA_NILAI,DATA!F2)&\" / \"&VLOOKUP($N$9,DATA_NILAI,DATA!G2)","v":"18190036 / 0034811338"}]
[null,"Kelas",null,":",{"$f":"VLOOKUP($N$9,DATA_NILAI,DATA!D2)","v":"X TKP 2"}]
[]
[null,"A. NILAI AKDEMIK"]
[null,"NO","SEMESTER","PENGETAHUAN",null,"KETERAMPILAN","NILAI AKHIR","PREDIKAT",null,null,null,null,"BOBOT NILAI"]
[null,1,"Ganjil",{"$f":"VLOOKUP($N$9,DATA_NILAI,DATA!H2)","v":0},null,{"$f":"VLOOKUP($N$9,DATA_NILAI,DATA!I2)","v":0},{"$f":"ROUND(N23/100*D23+N24/100*F23,0)","v":0},{"$f":"IFERROR(VLOOKUP(G23,TAB_PREDIKAT,3),\"-\")","v":"-"},null,null,null,null,"P",50]
[null,2,"Genap",{"$f":"VLOOKUP($N$9,DATA_NILAI,DATA!J2)","v":0},null,{"$f":"VLOOKUP($N$9,DATA_NILAI,DATA!K2)","v":0},{"$f":"ROUND(N23/100*D24+N24/100*F24,0)","v":0},{"$f":"IFERROR(VLOOKUP(G24,TAB_PREDIKAT,3),\"-\")","v":"-"},null,null,null,null,"K",50]
[]
[null,"B. DESKRIPSI AKADEMIK"]
[null,"NO","SEMESTER","DESKRIPSI NILAI"]
[null,1,"Ganjil",{"$f":"IFERROR(PROPER(E17)&\" \"&VLOOKUP(H23,DESK_NILAI,2,FALSE),\"-\")","v":"-"}]
[null,2,"Genap",{"$f":"IFERROR(PROPER(E17)&\" \"&VLOOKUP(H24,DESK_NILAI,2,FALSE),\"-\")","v":"-"}]
[]
[]
[null,"Mengetahui,",null,null,null,null,"Karawang, 21 Juni 2019"]
[null,"Orang Tua/Wali,",null,null,null,null,"Wali Kelas,"]
[]
[]
[]
[null,"_______________________________",null,null,null,null,{"$f":"VLOOKUP(E19,TAB_WALAS,2,FALSE)","v":"Nuri Hastuti Nuryani, S.Pd"}]
[]
[null,null,null,null,"Mengetahui :"]
[null,null,null,null,"Kepala Sekolah,",null,null,null,null,null,"-"]
[]
[]
[]
[null,null,null,null,"Drs. Agus Rukmawan, S.IP, MM"]
[null,null,null,null,"NIP 19611111 198603 1 008"]

{"sheet":"Macro1","index":4,"n_rows":0,"n_cols":0,"rows_kept":0,"cut":false,"hidden":true,"merged":[]}