{"text_format":"1","workbook":"xlsx","n_sheets":5,"sheets":["DB","SERTIFIKAT","DATA","KHB","Macro1"],"not_rendered":{"charts":0,"images":6,"macros":1,"external_links":3,"defined_names":17,"comments":0,"pivot_tables":0},"unopened":[],"bounds":{"document_bytes":16777216,"sheet_cells":100000,"rows_first":2000,"rows_last":500,"rows_between":2000,"halvings":0,"cell_chars":16384,"cell_head_chars":4096},"cells_cut":0,"cells_raw":0,"read":"whole","date_system":"1900"}

{"sheet":"DB","index":0,"n_rows":35,"n_cols":4,"rows_kept":35,"cut":false,"hidden":true,"merged":[]}
[]
[1,59,"D","belum menunjukkan pemahaman yang cukup pada sebagian besar materi Pendidikan Lingkungan Hidup"]
[60,69,"C","sudah menunjukkan pemahaman yang cukup pada semua materi Pendidikan Lingkungan Hidup"]
[70,74,"B-","secara konsisten menunjukkan pemahaman yang mendalam pada sebagian materi Pendidikan Lingkungan Hidup"]
[75,79,"B","secara konsisten menunjukkan pemahaman yang mendalam pada sebagian materi Pendidikan Lingkungan Hidup"]
[80,84,"B+","secara konsisten menunjukkan pemahaman yang mendalam pada sebagian materi Pendidikan Lingkungan Hidup"]
[85,89,"A-","secara konsisten menunjukkan pemahaman yang mendalam pada semua materi Pendidikan Lingkungan Hidup"]
[90,94,"A","secara konsisten menunjukkan pemahaman yang mendalam pada semua materi Pendidikan Lingkungan Hidup"]
[95,100,"A+","secara konsisten menunjukkan pemahaman yang mendalam pada semua materi Pendidikan Lingkungan Hidup"]
[]
[]
["X TKP 1","Rini Anggraeni, S.Pd, M.Pd"]
["X TKP 2","Nuri Hastuti Nuryani, S.Pd"]
["X TK 1","Deden Hamdani, Drs."]
["X TK 2","Zian Muzakkiyah K, S.Pd, M.Pd"]
["X TM 1","Hj. Diah Gustanti, S.T"]
["X TM 2","Tamrin, Drs, M.Pd"]
["X TM 3","Suhartini, S.Pd"]
["X TM 4","Maolana Nopiansyah, s.Pd.I"]
["X TM 5","Siti Nurjanah, S.Pd"]
["X TM 6","Prapti Suharyanti, S.Pd"]
["X TM 7","Tri Puji Astuti, S.Pd"]
["X TM 8","Rini Nurmalasari, S.Pd"]
["X TO 1","Kusmaya, S.Pd"]
["X TO 2","Rika Nurlaela, S.Pd"]
["X TO 3","Saeful Ikhrom, A.Md"]
["X TO 4","Sumarsono, S.T"]
["X TE 1","Ida Farida Artati"]
["X TE 2","Encep Pranseda, Drs., M.Pd."]
["X TE 3","Faridawaty Saragih, S.Si"]
["X TKI 1","Rita Rosita, S.Pd"]
["X TKI 2","Mila Karuniawati, S.Pd"]
["X TKI 3","Indria Listiani Ningrum, S.T"]
["X TKI 4","Ahmad Bustomi Sahrul, S.Pd"]
["X TKI 5","Asep Saeful Rohman, S.Ag"]

{"sheet":"SERTIFIKAT","index":1,"n_rows":34,"n_cols":49,"rows_kept":34,"cut":false,"hidden":true,"merged":[[10,29,11,29],[6,1,6,24],[5,1,5,24],[9,1,9,24],[19,35,19,36],[12,35,13,35],[12,36,13,36],[9,35,9,36],[15,35,15,36],[16,35,17,35],[16,36,17,36],[10,35,11,35],[10,36,11,36],[10,1,10,24],[12,1,12,24],[2,4,2,20],[13,1,13,24],[7,1,7,24]]}
[]
[]
[null,null,null,null,"SERTIFIKAT",null,null,null,null,null,null,null,null,null,null,null,null,null,null,null,null,null,null,null,null,null,null,null,null,null,null,null,null,null,null,null,null,null,null,77,{"$f":"602-526","v":76}]
[null,null,null,null,null,null,null,null,null,null,null,null,null,null,null,null,null,null,null,null,null,null,null,null,null,null,null,null,null,null,null,null,null,null,null,null,null,null,null,{"$f":"158-77","v":81},{"$f":"671-602","v":69}]
[null,null,null,null,null,null,null,null,null,null,null,null,null,null,null,null,null,null,null,null,null,null,null,null,null,null,null,null,null,null,null,null,null,null,null,null,null,null,null,{"$f":"230-158","v":72},{"$f":"821-671","v":150}]
[null,"Diberikan Kepada",null,null,null,null,null,null,null,null,null,null,null,null,null,null,null,null,null,null,null,null,null,null,null,null,null,null,null,null,null,null,null,null,null,null,null,null,null,{"$f":"379-230","v":149},{"$f":"898-821","v":77}]
[null,{"$f":"VLOOKUP($AK$17,DATASERTIFIKAT,DATA!E2)","v":"RAYHAN RAMADAN"},null,null,null,null,null,null,null,null,null,null,null,null,null,null,null,null,null,null,null,null,null,null,null,null,null,null,null,null,null,null,null,null,null,null,null,null,null,{"$f":"526-379","v":147}]
[null,{"$f":"\"NIS : \"&VLOOKUP($AK$17,DATASERTIFIKAT,DATA!F2)","v":"NIS : 18190204"}]
[]
[null,"Sebagai",null,null,null,null,null,null,null,null,null,null,null,null,null,null,null,null,null,null,null,null,null,null,null,null,null,null,null,"JURUSAN",null,null,null,null,null,"HALAMAN CETAK"]
[null,"Peringkat pertama",null,null,null,null,null,null,null,null,null,null,null,null,null,null,null,null,null,null,null,null,null,null,null,null,null,null,null,{"$error":"#REF!"},null,null,null,null,null,"Dari data ke",691]
[]
[null,"Pada Kelas XII TKJ 1 Semester Ganjil Tahun Pelajaran 2017/2018 Dengan Rata-rata Nilai 84,1",null,null,null,null,null,null,null,null,null,null,null,null,null,null,null,null,null,null,null,null,null,null,null,null,null,null,null,null,null,null,null,null,null,"Sampai data ke",695,null,null,{"$f":"72+149","v":221},{"$f":"77+81+150+77","v":385}]
[null,"Semoga Prestasi Yang Diraih Menjadi Motivasi Untuk Meraih Kesuksesan Di Masa Yang Akan Datang",null,null,null,null,null,null,null,null,null,null,null,null,null,null,null,null,null,null,null,null,null,null,null,null,null,null,null,null,null,null,null,null,null,null,null,null,null,{"$f":"147+76+69","v":292}]
[]
[null,null,null,null,null,null,null,null,null,null,null,null,null,null,null,null,null,null,null,null,null,null,null,null,null,null,null,null,null,null,null,null,null,null,null,"TAMPILAN DATA"]
[null,null,null,null,null,null,null,null,null,null,null,null,null,null,null,null,null,null,null,null,null,"Kepala SMKN 1 Karawang,",null,null,null,null,null,null,null,null,null,null,null,null,null,"Nomor Urut",240]
[]
[]
[null,null,null,null,null,null,null,null,null,null,null,null,null,null,null,null,null,null,null,null,null,null,null,null,null,null,null,null,null,null,null,null,null,null,null,{"$f":"VLOOKUP($AK$17,DATASERTIFIKAT,DATA!E2)","v":"RAYHAN RAMADAN"},null,null,null,null,null,"A",4,null,null,null,null,1,"D"]
[null,null,null,null,null,null,null,null,null,null,null,null,null,null,null,null,null,null,null,null,null,"Drs. Agus Rukmawan, S.IP, M.M"]
[null,null,null,null,null,null,null,null,null,null,null,null,null,null,null,null,null,null,null,null,null,"NIP. 19611111 198603 1 008"]
[]
[]
[]
[]
[]
[]
[]
[]
[]
[]
[]
[null,null,null,null,null,null,null,null,null,null,null,null,null,null,null,null,null,null,null,null,null,null,null,null,null,null,null,138]

{"sheet":"DATA","index":2,"n_rows":848,"n_cols":11,"rows_kept":848,"cut":false,"hidden":false,"merged":[]}
["NO.","CLASS ID","SORT","KELAS","NAMA SISWA","NIS","NISN","PENGETAHUAN 1","KETERAMPILAN 1","PENGETAHUAN 2","KETERAMPILAN 2"]
[1,{"$f":"A2+1","v":2},{"$f":"B2+1","v":3},4,5,6,7,8,9,10,11]
[1,{"$f":"D3&\"-\"&C3","v":"X TKP 1-1"},1,"X TKP 1","ABDUL KARIM",18190001,"0032989692",75,80,83,86]
[{"$f":"A3+1","v":2},"X TKP 1-2",{"$f":"IF(D3=D4,C3+1,1)","v":2},"X TKP 1","AIP ABDUL SUNANDAR",18190002,"0030065657",83,86,85,86]
[{"$f":"A4+1","v":3},{"$f":"D5&\"-\"&C5","v":"X TKP 1-3"},{"$f":"IF(D4=D5,C4+1,1)","v":3},"X TKP 1","ARYA FADEL HAKIM",18190003,"0021248937"]
[4,"X TKP 1-4",4,"X TKP 1","DESI",18190004,"0038817973"]
[5,"X TKP 1-5",5,"X TKP 1","DIAN LAURAINE ANAKKU",18190005,"0039899018"]
[6,"X TKP 1-6",6,"X TKP 1","DIMAS MAUSUL HAQIKI",18190006,"0032766311"]
[7,"X TKP 1-7",7,"X TKP 1","FISKA PUTRI DEWANI",18190007,"0031467706"]
[8,"X TKP 1-8",8,"X TKP 1","GELAR MAULANA MEDIA",18190008,"0029016811"]
[9,"X TKP 1-9",9,"X TKP 1","GILANG ILHAM PERMANA",18190009,"0034779820"]
[10,"X TKP 1-10",10,"X TKP 1","GILANG PRIA AMPATANA",18190010,"0022288946"]
[11,"X TKP 1-11",11,"X TKP 1","INDAH NURHALIZAH",18190011,"0030065656"]
[12,"X TKP 1-12",12,"X TKP 1","LUSIAWATI",18190013,"0037391018"]
[13,"X TKP 1-13",13,"X TKP 1","MOHAMAD SYAHRUL RIZKY",18190014,"-"]
[14,"X TKP 1-14",14,"X TKP 1","MUHAMMAD HAFIZH R",18190015,"0032783340"]
[15,"X TKP 1-15",15,"X TKP 1","MUHAMMAD RAFLY DWI RAHMAN",18190016,"0034779821"]
[16,"X TKP 1-16",16,"X TKP 1","MUHAMMAD RAIHAN",18190017,"0032491085"]
[17,"X TKP 1-17",17,"X TKP 1","MUHAMMAD RAIHANDY FAUZAN",18190018,"0039736055"]
[18,"X TKP 1-18",18,"X TKP 1","MUHAMMAD SALMAN",18190019,"0036773152"]
[19,"X TKP 1-19",19,"X TKP 1","MULYANTI",18190020,"0032741260"]
[20,"X TKP 1-20",20,"X TKP 1","NANA ARDIANSYAH",18190021,"0037748593"]
[21,"X TKP 1-21",21,"X TKP 1","NOVIA RAMADANI",18190022,"0039684937"]
[22,"X TKP 1-22",22,"X TKP 1","PUSPITA SARI",18190023,"0036607091"]
[23,"X TKP 1-23",23,"X TKP 1","QORI ABDUL MANSUR",18190024,"0037815117"]
[24,"X TKP 1-24",24,"X TKP 1","RAMLAN",18190025,"0031113948"]
[25,"X TKP 1-25",25,"X TKP 1","RARAS PRAMESTI",18190026,"0034805619"]
[26,"X TKP 1-26",26,"X TKP 1","RITA",18190027,"0034644760"]
[27,"X TKP 1-27",27,"X TKP 1","SALSABILA PUTRI SUHENDAR",18190028,"0037533933"]
[28,"X TKP 1-28",28,"X TKP 1","SITI ROSYDAH RUSTANDI",18190029,"0027950065"]
[29,"X TKP 1-29",29,"X TKP 1","SUKMA NOVIANTI",18190030,"0020500843"]
[30,"X TKP 1-30",30,"X TKP 1","SUSILAWATI",18190031,"0034132335"]
[31,"X TKP 1-31",31,"X TKP 1","TAUFIKURROHMAN ARDHAN",18190032,"0026074299"]
[32,"X TKP 1-32",32,"X TKP 1","WINDA",18190033,"0028658455"]
[33,"X TKP 1-33",33,"X TKP 1","YOSUA ANDREAS",18190034,"0023965427"]
[34,"X TKP 1-34",34,"X TKP 1","ZILDJIAN APRILIA",18190035,"0038657643"]
[35,"X TKP 2-1",1,"X TKP 2","ABDUL MAJID ALHISNA",18190036,"0034811338"]
[36,"X TKP 2-2",2,"X TKP 2","ANISA PUTRI HIDAYAT",18190037,"0032798639"]
[37,"X TKP 2-3",3,"X TKP 2","ANNISA PUTRI RAHAYU",18190038,"0030065584"]
[38,"X TKP 2-4",4,"X TKP 2","DILAN YUSUF ISLAMI",18190039,"0034779777"]
[39,"X TKP 2-5",5,"X TKP 2","DINA KHAIRUNNISA YARIS",18190040,"0032865899"]
[40,"X TKP 2-6",6,"X TKP 2","FARGAS FIRGIA",18190041,"0032615676"]
[41,"X TKP 2-7",7,"X TKP 2","FATHIYAH AIDA RIZMA",18190042,"0033471088"]
[42,"X TKP 2-8",8,"X TKP 2","FAUJI SETIAWAN",18190043,"0029435910"]
[43,"X TKP 2-9",9,"X TKP 2","FIRLI HILDAN FAHRURROZI",18190044,"0048780786"]
[44,"X TKP 2-10",10,"X TKP 2","IHDA PEBRIYANTI",18190046,"0031761174"]
[45,"X TKP 2-11",11,"X TKP 2","MAHESA SOFIAN SAPUTRA",18190047,"0035079626"]
[46,"X TKP 2-12",12,"X TKP 2","MARDANI",18190048,"0023849189"]
[47,"X TKP 2-13",13,"X TKP 2","MUCH FACHREADZKY RIDWAN",18190049,"3215015405"]
[48,"X TKP 2-14",14,"X TKP 2","MUHAMAD ZIHAN AWALIADIN",18190050,"0031002445"]
[49,"X TKP 2-15",15,"X TKP 2","MUHAMMAD FAUZAN MAKARIM",18190051,"0035316805"]
[50,"X TKP 2-16",16,"X TKP 2","MURSYID HANIF ARROJI",18190052,"0036243475"]
[51,"X TKP 2-17",17,"X TKP 2","NADILA AGUSTIN",18190053,"0039449407"]
[52,"X TKP 2-18",18,"X TKP 2","NAFIDZ ALIFAH MUKHRIJ PURNOMO",18190054,"0039553661"]
[53,"X TKP 2-19",19,"X TKP 2","RAYNALDO APRILIANO",18190055,"0032756888"]
[54,"X TKP 2-20",20,"X TKP 2","REVA ACHMAD ABQARI",18190056,"0031024779"]
[55,"X TKP 2-21",21,"X TKP 2","RICKY FAUZI",18190057,"0032516580"]
[56,"X TKP 2-22",22,"X TKP 2","RIFKY AHMAD RIANTO",18190058,"0034579920"]
[57,"X TKP 2-23",23,"X TKP 2","RIKI",18190059,"0027130013"]
[58,"X TKP 2-24",24,"X TKP 2","RIZKI MAULANA",18190060,"0039327074"]
[59,"X TKP 2-25",25,"X TKP 2","RIZKY MAULANA",18190061,"0027881567"]
[60,"X TKP 2-26",26,"X TKP 2","SAHRUL S RAHMADAN",18190062,"0035678900"]
[61,"X TKP 2-27",27,"X TKP 2","SANDI RUKMANA WAHYU ALAMSYAH",18190063,"0034283569"]
[62,"X TKP 2-28",28,"X TKP 2","SUCI NURAENI",18190065,"0011360536"]
[63,"X TKP 2-29",29,"X TKP 2","SUPARDI",18190066,"0035124599"]
[64,"X TKP 2-30",30,"X TKP 2","WAHYU AGUNG PRABOWO",18190067,"0029988519"]
[65,"X TKP 2-31",31,"X TKP 2","WIJDAN IBTISYAM",18190069,"0038671161"]
[66,"X TKP 2-32",32,"X TKP 2","YANUAR SILO HANDOYO",18190070,"0032611655"]
[{"$f":"A68+1","v":67},{"$f":"D69&\"-\"&C69","v":"X TKP 2-33"},{"$f":"IF(D68=D69,C68+1,1)","v":33},"X TKP 2","RENDRI NUZUL A'RIZKY","17180063","0002849791"]
[68,"X TK 1-1",1,"X TK 1","ABDUL HAFIDZ ZIAD FAESOL",18190071,"0039860796"]
[69,"X TK 1-2",2,"X TK 1","ADRIAN TEGAR FITRAYANSYAH",18190072,"0020786656"]
[70,"X TK 1-3",3,"X TK 1","ALWIANSYAH",18190073,"0032546772"]
[71,"X TK 1-4",4,"X TK 1","AZ ZAHRA DINDA KAMALIA",18190074,"0034418225"]
[72,"X TK 1-5",5,"X TK 1","BARA NAUFAL HILMAN",18190075,"0028174239"]
[73,"X TK 1-6",6,"X TK 1","BAYU MAULANA",18190076,"0037941012"]
[74,"X TK 1-7",7,"X TK 1","DARYADI",18190077,"0026277470"]
[75,"X TK 1-8",8,"X TK 1","DHAFA SEPTIAN PUFERTA HARYANTO",18190078,"0034478016"]
[76,"X TK 1-9",9,"X TK 1","DIENNA AGUSTIANA FITRIANA DEWI",18190079,"0036583246"]
[77,"X TK 1-10",10,"X TK 1","ELIS KHOERUNISA",18190080,"0033723028"]
[78,"X TK 1-11",11,"X TK 1","FADLAH FAQIH MASHOBIH",18190081,"0025939069"]
[79,"X TK 1-12",12,"X TK 1","FAJAR TRI NUGROHO",18190082,"0037233269"]
[80,"X TK 1-13",13,"X TK 1","GALIH SETIA NUGRAHA",18190083,"0034854147"]
[81,"X TK 1-14",14,"X TK 1","HAIKAL ZAENUL RAHMAT",18190084,"0020945997"]
[82,"X TK 1-15",15,"X TK 1","HAMAWIYAH MUZAHARA",18190085,"0038473396"]
[83,"X TK 1-16",16,"X TK 1","HARISMA HENDRIKA PERTIWI",18190086,"0033771811"]
[84,"X TK 1-17",17,"X TK 1","IQBAL SYAHID FIRMANSYAH",18190087,"0036799967"]
[85,"X TK 1-18",18,"X TK 1","KHOLIL RAMDAN",18190088,"0021482684"]
[86,"X TK 1-19",19,"X TK 1","LENI FITRIA",18190089,"0034945419"]
[87,"X TK 1-20",20,"X TK 1","MARIO ROLIANSYAH",18190090,"0039724970"]
[88,"X TK 1-21",21,"X TK 1","MUHAMMAD FARIZ",18190091,"0033872102"]
[89,"X TK 1-22",22,"X TK 1","MUHAMMAD MAULANA NUGRAHA",18190092,"0035895245"]
[90,"X TK 1-23",23,"X TK 1","MUHAMMAD ZIDAN",18190093,"0034441925"]
[91,"X TK 1-24",24,"X TK 1","NOVA",18190094,"0036985185"]
[92,"X TK 1-25",25,"X TK 1","NOVAL ARDIANTO",18190095,"0031971609"]
[93,"X TK 1-26",26,"X TK 1","NOVI",18190096,"0031580083"]
[94,"X TK 1-27",27,"X TK 1","NURFITRIA DESWITA PUTRI",18190097,"0026625233"]
[95,"X TK 1-28",28,"X TK 1","REVINA NOVIA ANINDARA",18190098,"0024435569"]
[96,"X TK 1-29",29,"X TK 1","REZA ARDIANSYAH",18190099,"0038234294"]
[97,"X TK 1-30",30,"X TK 1","REZA NUGRAHA",18190100,"0036385485"]
[98,"X TK 1-31",31,"X TK 1","RIFDA NUR SHINTA",18190101,"0020564695"]
[99,"X TK 1-32",32,"X TK 1","RIFKI IRAWAN",18190102,"0028772684"]
[100,"X TK 1-33",33,"X TK 1","RIYAN HIDAYAT",18190103,"0035151107"]
[101,"X TK 1-34",34,"X TK 1","SILVYIANIH KARDIAH",18190104,"0028931086"]
[102,"X TK 1-35",35,"X TK 1","TEGAR NUGRAHA",18190105,"0031129106"]
[103,"X TK 1-36",36,"X TK 1","ZENITHA PUJI KHAIRINA",18190106,"0033297000"]
[104,"X TK 2-1",1,"X TK 2","AHMAD HIDAYAT",18190107,"0037381970"]
[105,"X TK 2-2",2,"X TK 2","ALDY RIVALDY DE FRETES",18190108,"0039425024"]
[106,"X TK 2-3",3,"X TK 2","ALVINDRA PUTRA ARDHANA",18190109,"0033297054"]
[107,"X TK 2-4",4,"X TK 2","AMAR ASSHIDDIQIE HIDAYAT",18190110,"0021220841"]
[108,"X TK 2-5",5,"X TK 2","ANDIKA DWI PAMUNGKAS",18190111,"0031971571"]
[109,"X TK 2-6",6,"X TK 2","ARIF FIRDAOS",18190112,"0040430429"]
[110,"X TK 2-7",7,"X TK 2","DANI FRASETIA",18190113,"0026915433"]
[111,"X TK 2-8",8,"X TK 2","DEDY RAHMAT",18190114,"0026612814"]
[112,"X TK 2-9",9,"X TK 2","DHANUAR HUSSEIN",18190115,"0035957359"]
[113,"X TK 2-10",10,"X TK 2","DIDI MULYADI",18190116,"0034518526"]
[114,"X TK 2-11",11,"X TK 2","FADLI AJRILANA AHMAD",18190117,"0039705028"]
[115,"X TK 2-12",12,"X TK 2","FAHRUL MUAZID",18190118,"0033395000"]
[116,"X TK 2-13",13,"X TK 2","FAUZAN LUQMANUL HAKIM",18190119,"0039219892"]
[117,"X TK 2-14",14,"X TK 2","FIKRI RAFI PRATAMA ABDUL KADIR",18190120,"0026063513"]
[118,"X TK 2-15",15,"X TK 2","IBNU PADILAH",18190121,"0039781225"]
[119,"X TK 2-16",16,"X TK 2","IRFAN",18190122,"0033246285"]
[120,"X TK 2-17",17,"X TK 2","IZUMI ZAHRA HARIRY",18190123,"0042995074"]
[121,"X TK 2-18",18,"X TK 2","JAY MAULANA",18190124,"0035862559"]
[122,"X TK 2-19",19,"X TK 2","JEREMIA LEONARDO HUTASOIT",18190125,"0022126206"]
[123,"X TK 2-20",20,"X TK 2","KUNNIATUZ ZAHRA FIRDAUSI",18190126,"0036944087"]
[124,"X TK 2-21",21,"X TK 2","MUHAMAD RAKA MAULANA ZULKARNAEN",18190127,"0038657650"]
[125,"X TK 2-22",22,"X TK 2","MUHAMAD ROSIDI",18190128,"0032834145"]
[126,"X TK 2-23",23,"X TK 2","MUHAMMAD FARIZ ALVIANTO",18190129,"0026612794"]
[127,"X TK 2-24",24,"X TK 2","MUHAMMAD RIZKI ALAMSYAH",18190130,"0035269974"]
[128,"X TK 2-25",25,"X TK 2","NURDINA RAHMI",18190132,"0033181044"]
[129,"X TK 2-26",26,"X TK 2","PEBRIYANTI KUSNADI PRATIWI",18190133,"0034460885"]
[130,"X TK 2-27",27,"X TK 2","RAMDHANI RAFI TRIE MAULANA",18190134,"0034779899"]
[{"$f":"A132+1","v":131},{"$f":"D133&\"-\"&C133","v":"X TK 2-28"},{"$f":"IF(D132=D133,C132+1,1)","v":28},"X TK 2","RISKY RAHMAWATI",18190135,"0039126570"]
[132,"X TK 2-29",29,"X TK 2","RIZKY AGUNG RAMADHAN",18190136,"0022781741"]
[133,"X TK 2-30",30,"X TK 2","RIZKY PRATAMA",18190137,"0035503179"]
[134,"X TK 2-31",31,"X TK 2","SITI KHOERUNISA",18190138,"0032615747"]
[135,"X TK 2-32",32,"X TK 2","SUPRIYATNA",18190139,"0035126576"]
[136,"X TK 2-33",33,"X TK 2","TEGAR MAULANA ISHAK",18190140,"0029791431"]
[137,"X TK 2-34",34,"X TK 2","TITA APRIANTI",18190141,"0034997753"]
[138,"X TK 2-35",35,"X TK 2","TRI SALISTIA PEBRIAN",18190142,"0034966763"]
[139,"X TM 1-1",1,"X TM 1","AHMAD FAJAR SAEFUDIN",18190143,"0033315735"]
[140,"X TM 1-2",2,"X TM 1","AHMAD NURYUSUP HANAFI",18190144,"0039678050"]
[141,"X TM 1-3",3,"X TM 1","ALFAN GOFUR",18190145,"0028555270"]
[142,"X TM 1-4",4,"X TM 1","ARIEL FERDIANSYAH",18190146,"0024435312"]
[143,"X TM 1-5",5,"X TM 1","CEPI ARIS",18190147,"0021323779"]
[144,"X TM 1-6",6,"X TM 1","CITA RAMDAN",18190148,"0029197980"]
[145,"X TM 1-7",7,"X TM 1","DIAS PRASSETIO PADILAH",18190149,"0039019415"]
[146,"X TM 1-8",8,"X TM 1","DIDIK YULIANTO",18190150,"0025503684"]
[147,"X TM 1-9",9,"X TM 1","DWI RAHARJO",18190151,"0026255456"]
[148,"X TM 1-10",10,"X TM 1","DZULFIQRY",18190152,"0033297086"]
[149,"X TM 1-11",11,"X TM 1","HAPID JANUAR SYAPUTRA",18190153,"0028198001"]
[150,"X TM 1-12",12,"X TM 1","INDRA CIPTAWIJAYA",18190154,"0030498171"]
[151,"X TM 1-13",13,"X TM 1","IRVAN MAULANA",18190155,"0026559889"]
[152,"X TM 1-14",14,"X TM 1","JAJANG",18190156,"0027367097"]
[153,"X TM 1-15",15,"X TM 1","JODI NUGRAHA",18190157,"0032516550"]
[154,"X TM 1-16",16,"X TM 1","KARTIKA ASIH",18190158,"0033771819"]
[155,"X TM 1-17",17,"X TM 1","MOCHAMAD ALFIAN ALPARIZKI",18190159,"0035628027"]
[156,"X TM 1-18",18,"X TM 1","MOCHAMAD ANDRE FITRIYANTO",18190160,"0026255452"]
[157,"X TM 1-19",19,"X TM 1","MUHAMAD FAJAR RIYANTO",18190161,"0020922742"]
[158,"X TM 1-20",20,"X TM 1","MUHAMMAD ARI ALFARIZI",18190162,"0034846486"]
[159,"X TM 1-21",21,"X TM 1","MUHAMMAD DAFA NURHIDAYAT",18190163,"0036799957"]
[160,"X TM 1-22",22,"X TM 1","MUHAMMAD RIZAL NUR AKBAR",18190164,"0039081270"]
[161,"X TM 1-23",23,"X TM 1","MUHAMMAD YAZID FADHILLAH",18190165,"0034883253"]
[162,"X TM 1-24",24,"X TM 1","NANANG KURMANI",18190166,"0031509468"]
[163,"X TM 1-25",25,"X TM 1","RADEN RIZKI RAFI ARISSAPUTRA",18190167,"0034573805"]
[164,"X TM 1-26",26,"X TM 1","RAFA NAUFAL ISHAM SUBHANA",18190168,"0038219075"]
[165,"X TM 1-27",27,"X TM 1","RAFLY RIYADHUL NUR SYAFWAN",18190169,"0037012723"]
[166,"X TM 1-28",28,"X TM 1","RAIHAN RAMDHANI",18190170,"0023183214"]
[167,"X TM 1-29",29,"X TM 1","REZA AFRIANSYAH",18190171,"0026255054"]
[168,"X TM 1-30",30,"X TM 1","SARIP HIDAYAT",18190172,"0032615741"]
[169,"X TM 1-31",31,"X TM 1","SULIS SETIO HADI",18190173,"0036297287"]
[170,"X TM 1-32",32,"X TM 1","TAOFIK BILLAHI",18190174,"0039663421"]
[171,"X TM 1-33",33,"X TM 1","TEDI SETIADI",18190175,"0038705461"]
[172,"X TM 1-34",34,"X TM 1","TISNA SAHRUN",18190176,"0038397476"]
[173,"X TM 1-35",35,"X TM 1","WAHYU RAMDHANI",18190177,"0023111975"]
[174,"X TM 1-36",36,"X TM 1","WINDA LISTIANI",18190178,"0027543098"]
[175,"X TM 2-1",1,"X TM 2","ADI KARYA HUSADA",18190179,"0028312577"]
[176,"X TM 2-2",2,"X TM 2","AHMAD MUAZIR",18190180,"0021085373"]
[177,"X TM 2-3",3,"X TM 2","AHMAD SHOIMUN DZULFIQOR",18190181,"0046675202"]
[178,"X TM 2-4",4,"X TM 2","AKBAR NUR ALHAEN",18190182,"0033297352"]
[179,"X TM 2-5",5,"X TM 2","ALDIE SHEVA SUGARA",18190183,"0003167888"]
[180,"X TM 2-6",6,"X TM 2","ALVIN KAKA YUDISTIRA",18190184,"0044270357"]
[181,"X TM 2-7",7,"X TM 2","ANJANI SYAWALIYAH",18190185,"0024114474"]
[182,"X TM 2-8",8,"X TM 2","DANDI KUSWARA",18190186,"0031046477"]
[183,"X TM 2-9",9,"X TM 2","DENA FIRMANSYAH",18190187,"0022409377"]
[184,"X TM 2-10",10,"X TM 2","EDI GUNAWAN",18190188,"0028854701"]
[185,"X TM 2-11",11,"X TM 2","FAUZI RAKA PRATAMA",18190189,"0037925648"]
[186,"X TM 2-12",12,"X TM 2","FERDINATA",18190190,"0028964558"]
[187,"X TM 2-13",13,"X TM 2","FIKRI ANISAH",18190191,"0025006576"]
[188,"X TM 2-14",14,"X TM 2","FRANSISKUS SITOHANG",18190192,"0022292984"]
[189,"X TM 2-15",15,"X TM 2","HERI SETIAWAN",18190193,"0035740047"]
[190,"X TM 2-16",16,"X TM 2","ILYAS TIA FIRMANSYAH",18190194,"0035168648"]
[191,"X TM 2-17",17,"X TM 2","INDRA PERMANA",18190195,"0031722734"]
[192,"X TM 2-18",18,"X TM 2","JODI ADITTYA INDRAWAN",18190196,"0025129558"]
[193,"X TM 2-19",19,"X TM 2","MARIAH",18190197,"0044105309"]
[194,"X TM 2-20",20,"X TM 2","MUHAMAD ABDURROHIM",18190198,"0047858895"]
[{"$f":"A196+1","v":195},{"$f":"D197&\"-\"&C197","v":"X TM 2-21"},{"$f":"IF(D196=D197,C196+1,1)","v":21},"X TM 2","MUHAMAD IRFAN",18190199,"0036080982"]
[196,"X TM 2-22",22,"X TM 2","MUHAMMAD RIZKI  RAMADHAN",18190200,"0031729443"]
[197,"X TM 2-23",23,"X TM 2","MUHAMMAD SHOLIHUDIN",18190201,"0032490632"]
[198,"X TM 2-24",24,"X TM 2","PADLI APRIYANA",18190202,"0036387827"]
{"$rows_left_out":649}
{"sheet":"KHB","index":3,"n_rows":45,"n_cols":14,"rows_kept":45,"cut":false,"hidden":false,"merged":[[7,12,7,13],[12,12,12,13],[13,12,14,12],[13,13,14,13],[8,12,10,12],[8,13,10,13],[21,12,21,13],[9,2,9,7],[10,2,10,7],[15,12,16,12],[15,13,16,13],[26,3,26,7],[27,3,27,7],[28,3,28,7],[11,1,11,7],[12,1,12,7],[13,1,13,7],[16,4,16,6],[17,4,17,6],[21,3,21,4],[22,3,22,4],[23,3,23,4],[18,4,18,5],[7,1,7,7],[8,1,8,7],[1,1,1,7],[2,1,2,7],[3,1,3,7],[4,1,4,7],[5,1,5,7],[6,1,6,7]]}
[]
[null,"PEMERINTAH DAERAH PROVINSI JAWA BARAT"]
[null,"DINAS PENDIDIKAN"]
[null,"CABANG DINAS PENDIDIKAN WILAYAH IV"]
[null,"SEKOLAH MENENGAH KEJURUAN NEGERI 1 KARAWANG"]
[null,"Jalan Pangkal Perjuangan By Pass Telp. 0267-401651"]
[null,"Website: www.smkn1karawang.sch.id"]
[null,"Email : smkn1karawang@gmail.com",null,null,null,null,null,null,null,null,null,null,"TAMPILAN DATA"]
[null,"Karawang - 41316",null,null,null,null,null,null,null,null,null,null,"Nomor Urut",35]
[]
[]
[null,"KARTU HASIL BELAJAR"]
[null,"TAHUN PELAJARAN 2018/2019",null,null,null,null,null,null,null,null,null,null,"HALAMAN CETAK"]
[null,"MATA PELAJARAN PENDIDIKAN LINGKUNGAN HIDUP",null,null,null,null,null,null,null,null,null,null,"Dari data ke",2]
[]
[null,null,null,null,null,null,null,null,null,null,null,null,"Sampai data ke",2]
[null,"Nama Peserta Didik",null,":",{"$f":"VLOOKUP($N$9,DATA_NILAI,DATA!E2)","v":"ABDUL MAJID ALHISNA"}]
[null,"Nomor Induk/NISN",null,":",{"$f":"VLOOKUP($N$9,DATA_NILAI,DATA!F2)&\" / \"&VLOOKUP($N$9,DATA_NILAI,DATA!G2)","v":"18190036 / 0034811338"}]
[null,"Kelas",null,":",{"$f":"VLOOKUP($N$9,DATA_NILAI,DATA!D2)","v":"X TKP 2"}]
[]
[null,"A. NILAI AKDEMIK"]
[null,"NO","SEMESTER","PENGETAHUAN",null,"KETERAMPILAN","NILAI AKHIR","PREDIKAT",null,null,null,null,"BOBOT NILAI"]
[null,1,"Ganjil",{"$f":"VLOOKUP($N$9,DATA_NILAI,DATA!H2)","v":0},null,{"$f":"VLOOKUP($N$9,DATA_NILAI,DATA!I2)","v":0},{"$f":"ROUND(N23/100*D23+N24/100*F23,0)","v":0},{"$f":"IFERROR(VLOOKUP(G23,TAB_PREDIKAT,3),\"-\")","v":"-"},null,null,null,null,"P",50]
[null,2,"Genap",{"$f":"VLOOKUP($N$9,DATA_NILAI,DATA!J2)","v":0},null,{"$f":"VLOOKUP($N$9,DATA_NILAI,DATA!K2)","v":0},{"$f":"ROUND(N23/100*D24+N24/100*F24,0)","v":0},{"$f":"IFERROR(VLOOKUP(G24,TAB_PREDIKAT,3),\"-\")","v":"-"},null,null,null,null,"K",50]
[]
[null,"B. DESKRIPSI AKADEMIK"]
[null,"NO","SEMESTER","DESKRIPSI NILAI"]
[null,1,"Ganjil",{"$f":"IFERROR(PROPER(E17)&\" \"&VLOOKUP(H23,DESK_NILAI,2,FALSE),\"-\")","v":"-"}]
[null,2,"Genap",{"$f":"IFERROR(PROPER(E17)&\" \"&VLOOKUP(H24,DESK_NILAI,2,FALSE),\"-\")","v":"-"}]
[]
[]
[null,"Mengetahui,",null,null,null,null,"Karawang, 21 Juni 2019"]
[null,"Orang Tua/Wali,",null,null,null,null,"Wali Kelas,"]
[]
[]
[]
[null,"_______________________________",null,null,null,null,{"$f":"VLOOKUP(E19,TAB_WALAS,2,FALSE)","v":"Nuri Hastuti Nuryani, S.Pd"}]
[]
[null,null,null,null,"Mengetahui :"]
[null,null,null,null,"Kepala Sekolah,",null,null,null,null,null,"-"]
[]
[]
[]
[null,null,null,null,"Drs. Agus Rukmawan, S.IP, MM"]
[null,null,null,null,"NIP 19611111 198603 1 008"]

{"sheet":"Macro1","index":4,"n_rows":0,"n_cols":0,"rows_kept":0,"cut":false,"hidden":true,"merged":[]}